{"text_format":"3","workbook":"xlsx","n_sheets":5,"sheets":["CONSECUTIVO","DATOS","RECIBO (2)","RECIBO","ADJUNTO MILLER"],"not_rendered":{"images":3,"macros":1,"defined_names":2},"read":"whole","date_system":"1900"}

{"sheet":"CONSECUTIVO","index":0,"n_rows":220,"n_cols":10,"rows_kept":220}
[null,"Nº","RECIBIDO DE:","VALOR","FORMA DE PAGO","POR CONCEPTO DE: 1/5","POR CONCEPTO DE: 2/5","POR CONCEPTO DE: 3/5","POR CONCEPTO DE: 4/5","POR CONCEPTO DE: 5/5"]
[null,1,"JAVIER FONCECA DIAZ",{"v":15000000,"d":"$ 15,000,000"},"EFECTIVO",null,"ABONO VENTA CENTRO DE MECANIZADO LEADWELL REFERENCIA V20i (Nº SERIE L2TJI0269)"]
[null,2,"POLICROMETAL",{"v":950000,"d":"$ 950,000"},"EFECTIVO",null,"1 MECANIZADO EN ACERO SEGÚN ESPECIFICACION DE PLANOS. ($600.000)"]
[null,3,"MAURICIO LEADWELL",{"v":15000000,"d":"$ 15,000,000"},"EFECTIVO",null,"ABONO VENTA CENTRO DE MECANIZADO LEADWELL REFERENCIA V20i (Nº SERIE L2TJI0269)"]
[null,4,"LEIDY JHOJANNA BORJA LEAL",{"v":110000000,"d":"$ 110,000,000"},"EFECTIVO",null,"SALDO VENTA CENTRO DE MECANIZADO LEADWELL REFERENCIA V20i (Nº SERIE L2TJI0269)"]
[null,5,"JOHN FERNEY GUTIERREZ LARA",{"v":8000000,"d":"$ 8,000,000"},"EFECTIVO",null,"ABONO MOLDES MICHELIN"]
[null,6,"CLAUDIA GUERRERO",{"v":40000,"d":"$ 40,000"},"EFECTIVO",null,"ARREGLO CONTROLADORA DE VISORES ($30.000)","VENTA BUS DE DATOS PUERTO SERIE (DB9) PARA BOARD ($10.000)"]
[null,7,"JASON ALEXANDER SALAZAR",{"v":150000,"d":"$ 150,000"},"Eefectivo",null,"ABONO MECANIZADO DE 10 PIEZAS IGUALES SEGÚN PLANO POR VALOR DE $25.000 C/U","PARA UN TOTAL DE $250.000","SALDO DE $100.000"]
[null,8,"JAVIER FONCECA DIAZ",{"v":5000000,"d":"$ 5,000,000"},"EFECTIVO",null,"PAGO DOBLADORA PBB 1270/2A PAN & BOX BRAKE","SERIAL No: A14030797         DATE: 2014 03"]
[null,9,null,{"v":945000,"d":"$ 945,000"},"CRUCE DE CUENTAS",null,"PAGO VOUCHER´S CARGADOS A LA CUENTA 48551 (SALITRE). SEGÚN CUENTA DE COBRO 002. $375.000 ","PAGO 3 PLANTAS GSM TARIFADORAS CON VISOR $570.000"]
[null,10,null,{"v":200000,"d":"$ 200,000"},"EFECTIVO","PAGO VOUCHER´S CARGADOS A LA CUENTA 90669.","1481622771 USADO 2016-05-04 12:32  ($200.000ºº)"]
[null,11,null,{"v":200000,"d":"$ 200,000"},"EFECTIVO","PAGO VOUCHER´S CARGADOS A LA CUENTA 09291.","0503828231  USADO 04/05/2016  04:12:00 p.m.  ($200.000ºº)"]
[null,12,null,{"v":300000,"d":"$ 300,000"},"EFECTIVO","PAGO VOUCHER´S CARGADOS A LA CUENTA 90669.","1890346254 USADO 2016-09-05 09:30  ($300.000ºº)"]
[null,13,null,{"v":480000,"d":"$ 480,000"},"EFECTIVO",null,"2 PLANTAS GSM TARIFADORA S/N: 0610172, 0610173. VISOR S/N: 0620172, 0620173 $400.000","2 TELEFONO PANASONIC KX-TS500 S/N; 0DBKC038755, 0DBKC036600. $80.000"]
[null,14,null,{"v":200000,"d":"$ 200,000"},"EFECTIVO","PAGO VOUCHER´S CARGADOS A LA CUENTA 90669.","8768949932 USADO 14/10/2016  09:46:00 a.m.  ($200.000ºº)"]
[null,15,null,{"v":200000,"d":"$ 200,000"},"EFECTIVO","PAGO VOUCHER´S CARGADOS A LA CUENTA 90669.","2124707471 USADO 2016-11-08 09:11 ($200.000ºº)"]
[null,16,null,{"v":35000,"d":"$ 35,000"},"EFECTIVO","ENVIO DE 777 SMS, $45 C/U."]
[null,17,null,{"v":33500,"d":"$ 33,500"},"EFECTIVO","ENVIO DE 745 SMS, $45 C/U."]
[null,18,null,{"v":40000,"d":"$ 40,000"},"EFECTIVO",null,"PROGRAMACION MICROCONTROLADOR Y PLANTA, PLANTA GSM TARIFADORA S/N: 0610064 $25","CAMBIO PULSADOR PLANTA GSM TARIFADORA S/N: 0610134 $15"]
[null,19]
[null,20]
[null,21]
[null,22]
[null,23]
[null,24]
[null,25]
[null,26]
[null,27]
[null,28]
[null,29]
[null,30]
[null,31]
[null,32]
[null,33]
[null,34]
[null,35,null,{"v":1000000,"d":"$ 1,000,000"},"EFECTIVO","PAGO VOUCHER´S CARGADOS A LA CUENTA 90669.","0502342605 USADO 31/03/2014  08:26:00 a.m.  ($500.000ºº)","8964029679 USADO 07/04/2014  01:00:00 p.m.  ($500.000ºº)"]
[null,36,null,{"v":1000000,"d":"$ 1,000,000"},"EFECTIVO","PAGO VOUCHER´S CARGADOS A LA CUENTA 90669.","3435821913 USADO 14/04/2014  08:28:00 a.m.  ($500.000ºº)","4595042319 USADO 24/04/2014  08:33:00 a.m.  ($500.000ºº)"]
[null,37,null,{"v":180000,"d":"$ 180,000"},"EFECTIVO","LINKSYS WRTP-54G S/N CJJ11GA00775"]
[null,38,null,{"v":375000,"d":"$ 375,000"},"CRUCE DE CUENTAS","PAGO VOUCHER´S CARGADOS A LA CUENTA 48551 (SALITRE).","4393279200 USADO 06/07/2015  11:05:00 a.m.","SEGÚN CUENTA DE COBRO 019."]
[null,39,null,{"v":215865,"d":"$ 215,865"},"CRUCE DE CUENTAS","UTILIDAD PUNTO SALITRE, JULIO DE 2015.","SE HIZO LA REVISION DE LA CONTABILIDAD PUNTO SALITRE DEL MES DE JULIO,","DE FORMA SATISFACTORIA POR PARTE DE IPCOL."]
[null,40,null,{"v":600000,"d":"$ 600,000"},"CRUCE DE CUENTAS","ARRIENDO OFICINA 201 UBICADA EN LA CARRERA 16 Nº 61-23, BOGOTA D.C.","MES: JULIO 2015."]
[null,41,null,{"v":356,"d":"$ 356"},"CRUCE DE CUENTAS","SALDO PENDIENTE, CRUCE DE CUENTAS DELAERCOM - IPCOL DEL MES JUNIO 2015."]
[null,42,null,{"v":375000,"d":"$ 375,000"},"CRUCE DE CUENTAS","PAGO VOUCHER´S CARGADOS A LA CUENTA 48551 (SALITRE).","6484682405 USADO 08/08/2015  12:36:00 p.m.","SEGÚN CUENTA DE COBRO 021."]
[null,43,null,{"v":699525,"d":"$ 699,525"},"CRUCE DE CUENTAS","UTILIDAD PUNTO SALITRE, AGOSTO DE 2015.","SE HIZO LA REVISION DE LA CONTABILIDAD PUNTO SALITRE DEL MES DE AGOSTO,","DE FORMA SATISFACTORIA POR PARTE DE IPCOL."]
[null,44,null,{"v":600000,"d":"$ 600,000"},"CRUCE DE CUENTAS","ARRIENDO OFICINA 201 UBICADA EN LA CARRERA 16 Nº 61-23, BOGOTA D.C.","MES: AGOSTO 2015."]
[null,45,null,{"v":15771261,"d":"$ 15,771,261"},"CRUCE DE CUENTAS","SALDO PENDIENTE, CRUCE DE CUENTAS DELAERCOM - IPCOL DEL MES JULIO 2015."]
[null,46,null,{"v":1850,"d":"$ 1,850"},"EFECTIVO","SALDO CRUCE DE CUENTAS IPCOL - DEALERCOM AGOSTO 2015."]
[null,47,null,{"v":130000,"d":"$ 130,000"},"EFECTIVO","LINKSYS WRTP 54G S/N: CJJ11GA00008"]
[null,48]
[null,49]
[null,50]
[null,51]
[null,52]
[null,53]
[null,54]
[null,55]
[null,56]
[null,57]
[null,58]
[null,59]
[null,60]
[null,61]
[null,62]
[null,63]
[null,64]
[null,65]
[null,66]
[null,67]
[null,68]
[null,69]
[null,70]
[null,71]
[null,72]
[null,73]
[null,74]
[null,75]
[null,76]
[null,77]
[null,78]
[null,79]
[null,80]
[null,81]
[null,82]
[null,83]
[null,84]
[null,85]
[null,86]
[null,87]
[null,88]
[null,89]
[null,90]
[null,91]
[null,92]
[null,93]
[null,94]
[null,95]
[null,96]
[null,97]
[null,98]
[null,99]
[null,100]
[null,101]
[null,102]
[null,103]
[null,104]
[null,105]
[null,106]
[null,107]
[null,108]
[null,109]
[null,110]
[null,111]
[null,112]
[null,113]
[null,114,"DIEGO RODRIGUEZ",{"v":100000,"d":"$ 100,000"},"EFECTIVO","PAGO VOUCHER´S CARGADOS A LA CUENTA 03541.","1765339230 USADO 04/10/2013  10:00:00 a.m.  ($100.000ºº)"]
[null,115,"DIANA ALFONSO",{"v":200000,"d":"$ 200,000"},"EFECTIVO","LINKSYS WRTP-54G S/N CJJ11GB00211 ($150.000)","INSTALACION Y CONFIGURACION SIPTAR CALLSHOP Y LINKSYS ($50.000)"]
[null,116,"DEALERCOM LTDA.",{"v":144600,"d":"$ 144,600"},"CRUCE DE CUENTAS",null,"Aportes obligatorios al sistema de seguridad social integral mediante la planilla integrada de","liquidacion de aportes en el periodo diciembre 2013 - enero 2014. (Luisa F. Rodriguez C.).","SEGÚN CUENTA DE COBRO 064 del 2013."]
[null,117,"DEALERCOM LTDA.",{"v":719562,"d":"$ 719,562"},"CRUCE DE CUENTAS","UTILIDAD PUNTO SALITRE, NOVIEMBRE DE 2013.","SE HIZO LA REVISION DE LA CONTABILIDAD PUNTO SALITRE DEL MES DE NOVIEMBRE,","DE FORMA SATISFACTORIA POR PARTE DE IPCOL."]
[null,118,"DEALERCOM LTDA.",{"v":600000,"d":"$ 600,000"},"CRUCE DE CUENTAS","ARRIENDO OFICINA 201 UBICADA EN LA CARRERA 16 Nº 61-23, BOGOTA D.C.","MES: NOVIEMBRE 2013."]
[null,119,"DEALERCOM LTDA.",{"v":375000,"d":"$ 375,000"},"CRUCE DE CUENTAS","PAGO VOUCHER´S CARGADOS A LA CUENTA 48551 (SALITRE).","5445276480 USADO 18/12/2013  08:57:00 a.m.","SEGÚN CUENTA DE COBRO 065."]
{"$rows_left_out":101}
{"sheet":"DATOS","index":1,"n_rows":48,"n_cols":7,"rows_kept":48}
[null,"NOMBRE","DIRECCION","TELEFONO","C.C.","NIT.","Nº C.C. ó NIT."]
[null,"ADRIANA CUELLAR","CARRERA 16 Nº 61-23",5476324,"X",null,{"v":51984374,"d":"51,984,374"}]
[null,"ALEXANDER RODRIGUEZ","CRA 24 Nº 61D-15",3015259997,"X",null,{"v":11323591,"d":"11,323,591"}]
[null,"ALFONSO MILLAN","AV. 19 Nº 136-38",2585424,"X",null,{"v":19139315,"d":"19,139,315"}]
[null,"ANA MARIA OVALLE","CARRERA 1G ESTE Nº 76B-27 SUR",{"v":3108009344,"d":"3,108,009,344"},"X"]
[null,"ANDREY GERONIMO AVELLA PEREZ","CALLE 39 SUR Nº 31A-47",7004325,"X",null,{"v":1057587219,"d":"1,057,587,219"}]
[null,"CARL0S ZAMBRANO","CALLE 3 # 3-61",3103468454,"X",null,{"v":79325373,"d":"79,325,373"}]
[null,"CARLOS RIGUEROS",null,3106803329,"X",null,{"v":79556310,"d":"79,556,310"}]
[null,"CARMELA ROMERO","CRA. 14 N 147-70 L. 53","3124466282  -  6260912"]
[null,"CESAR CIFUENTES DIAZ","CALLE 49 Nº 16-04 BUCARAMANGA",3204272712,"X",null,{"v":1128449636,"d":"1,128,449,636"}]
[null,"CLAUDIA PAY","CENTRO"]
[null,"DEALERCOM LTDA.","CARRERA 16 Nº 61-23",3474237,null,"X","830.104.838-3"]
[null,"DIANA ALFONSO","CARRERA 59A Nº 135-95 LOCAL 2",4744499]
[null,"DIEGO RODRIGUEZ","CALLE 57 Nº 13-74",8050400,"X",null,{"v":79380941,"d":"79,380,941"}]
[null,"EDNA HERNANDEZ","CALLE 57 Nº 23-50",3208608313,"X",null,{"v":65746344,"d":"65,746,344"}]
[null,"EVARISTO ROMERO","AV. CALLE 13 Nº 90-89",2678757]
[null,"FERNANDO SIERRA","DIAGONAL 61B Nº 18-41",3112004536,"X",null,{"v":79471596,"d":"79,471,596"}]
[null,"FRANKY RAMIREZ","CALLE 59 BIS Nº 76-62 SUR",3133901465,"X",null,{"v":80720705,"d":"80,720,705"}]
[null,"GABRIEL REYES",null,3103468464]
[null,"GIOVANNY AVILA","CALLE 65A Nº 17-71",8003777,"X",null,{"v":79797514,"d":"79,797,514"}]
[null,"HERNAN RODRIGUEZ","AV. CALLE 19 Nº 20-76 APTO. 422","3143305562 - 3093764","X",null,{"v":7306340,"d":"7,306,340"}]
[null,"JAIME PEREZ","TV 28B Nº 36-53",7450950,null,"X","900.536.751-9"]
[null,"LEONEL DIAZ",null,null,"X",null,{"v":19430912,"d":"19,430,912"}]
[null,"LUZ DARY CAMACHO","CARRERA 17 A Nº 12-25 SOACHA","5766866 - 3143226443","X",null,{"v":39544811,"d":"39,544,811"}]
[null,"MARILUZ TORRES","CRA 87 Nº 51B-74 SUR","7833252 - 3115543491","X",null,{"v":52173075,"d":"52,173,075"}]
[null,"MILLER SAAVEDRA","CALLE 17 Nº 8-49 OF. 611",4805050]
[null,"OSMAN MARTINEZ",null,3102556281]
[null,"PAY PHONE"]
[null,"PEDRO VARGAS","CRA 24 Nº 22C-08",3118871175,"X",null,{"v":93419176,"d":"93,419,176"}]
[null,"PHONET","TRANSVERSAL 24 Nº 61B-16",2178535]
[null,"PUNZONAR LTDA.","CALLE 71 # 74A - 51",2230697,null,"X","830.133.512-1"]
[null,"VICTOR HUGO SANABRIA PIÑA","CALLE 45 Nº 51-14",3214493320,"X",null,{"v":93383932,"d":"93,383,932"}]
[null,"WILLIAM ROMERO","CLLE. 65 CON 80 SUR BOSA",3158754759]
[null,"YESID PEREA","QUIBDO CHOCO",3216456494,"X",null,{"v":11799581,"d":"11,799,581"}]
[null,"YINNA CRUZ","CARRERA 7 CON 71",310319118]
[null,"OSCAR MARMOLEJO",null,3105849118,null,null,{"v":79153777,"d":"79,153,777"}]
[null,"ANGEL VALOYES M",null,3214640337]
[null,"CARLOS AGUDELO",null,3128055844,"X",null,{"v":1052393812,"d":"1,052,393,812"}]
[null,"ALEGRIA BALSECA",null,"(593) 987863250","X",null,{"v":1705164794,"d":"1,705,164,794"}]
[null,"POLICROMETAL","CARRERA 68A # 36A-77 SUR INT. 2",5631631]
[null,"CESAR HERRERA","CALLE 47A # 29-17",3125701916,"X",null,{"v":79726937,"d":"79,726,937"}]
[null,"CLAUDIA GUERRERO","CARRERA 64B #55A-47 SUR",3125822873,"X",null,{"v":51854507,"d":"51,854,507"}]
[null,"JASON ALEXANDER SALAZAR","CARRERA 24 #41B-33 SUR",3184763126,"X",null,{"v":1013595731,"d":"1,013,595,731"}]
[null,"CARLOS SARMIENTO","CALLE 7 A SUR # 2 - 57",3178764059,"X",null,{"v":80068604,"d":"80,068,604"}]
[null,"JAVIER FONCECA DIAZ","CALLE 18 # 15-06",3105665046,"X",null,{"v":1094885127,"d":"1,094,885,127"}]
[null,"MAURICIO CASTRO","CALLE 71C # 91A-20",3044494275,"X",null,{"v":80034633,"d":"80,034,633"}]
[null,"LEIDY JHOJANNA BORJA LEAL","CALLE 79D Bis # 110 – 20",3044494275,"X",null,{"v":1120354231,"d":"1,120,354,231"}]
[null,"JOHN FERNEY GUTIERREZ LARA","CALLE 2 # 38B 43",3124482140,"X",null,{"v":74184896,"d":"74,184,896"}]

{"sheet":"RECIBO (2)","index":2,"n_rows":27,"n_cols":9,"rows_kept":27,"merged":[[0,3,0,8],[1,3,1,7],[3,1,3,3],[4,1,4,8],[5,0,5,2],[6,3,6,8],[9,0,9,8],[11,2,11,8],[12,0,12,8],[13,0,13,8],[14,0,14,8],[15,0,15,8],[16,0,16,8],[17,0,17,8],[25,0,25,8],[26,0,26,8]]}
[{"$nulls":3},"RECIBO DE CAJA"]
[{"$nulls":3},"Nº",{"$nulls":4},{"v":1,"d":"001"}]
[]
["FECHA:",{"$f":"NOW()","v":"2023-06-29T10:37:05.130"},{"$nulls":6},{"$f":"VLOOKUP(I2,CONSECUTIVO!$B$2:$H$200,3,FALSE)","v":{"v":15000000,"d":"$ 15,000,000"}}]
["RECIBIDO DE:",{"$f":"VLOOKUP(I2,CONSECUTIVO!$B$2:$H$200,2,FALSE)","v":"JAVIER FONCECA DIAZ"}]
[{"$f":"\"DIRECCION:        \"&VLOOKUP(B5,DATOS!$B$2:$G$100,2,FALSE)","v":"DIRECCION:        CALLE 18 # 15-06"},null,null,"C.C.",{"$f":"\"\"&VLOOKUP(B5,DATOS!$B$2:$F$100,4,FALSE)","v":"X"},"NIT.",{"$f":"\"\"&VLOOKUP(B5,DATOS!$B$2:$F$100,5,FALSE)","v":""},null,{"$f":"VLOOKUP(B5,DATOS!$B$2:$G$100,6,FALSE)","v":{"v":1094885127,"d":"1,094,885,127"}}]
["FORMA DE PAGO:",null,{"$f":"\"\"&VLOOKUP(I2,CONSECUTIVO!$B$2:$H$200,4,FALSE)","v":"EFECTIVO"},{"$f":"\"TEL.  \"&VLOOKUP(B5,DATOS!$B$2:$G$100,3,FALSE)","v":"TEL.  3105665046"}]
[]
[]
[{"$f":"PesosCO(I4)","v":"LA SUMA DE:  QUINCE MILLONES PESOS M/CTE."}]
[]
[]
[{"$f":"\"POR CONCEPTO DE:  \"&VLOOKUP(I2,CONSECUTIVO!$B$2:$H$200,5,FALSE)","v":"POR CONCEPTO DE:  "}]
[]
[{"$f":"\"\"&VLOOKUP(I2,CONSECUTIVO!$B$2:$H$200,6,FALSE)","v":"ABONO VENTA CENTRO DE MECANIZADO LEADWELL REFERENCIA V20i (Nº SERIE L2TJI0269)"}]
[{"$f":"\"\"&VLOOKUP(I2,CONSECUTIVO!$B$2:$H$200,7,FALSE)","v":""}]
[{"$f":"\"\"&VLOOKUP(I2,CONSECUTIVO!$B$2:$I$200,8,FALSE)","v":""}]
[{"$f":"\"\"&VLOOKUP(I2,CONSECUTIVO!$B$2:$J$200,9,FALSE)","v":""}]
["   DINERO ENTREGADO POR:",null,null,"      FIRMA Y SELLO DE RECIBIDO:"]
[]
[]
["  __________________",null,null,"       ______________________"]
["NIT. o  C.C."]
["      ",null,null,"                  "]
[]
["Calle 39 SUR Nº 31A-47  Barrio Ingles  Bogotá D.C. Colombia.  Tel: 7004325"]
["pagina web:   metaltronicos.com"]

{"sheet":"RECIBO","index":3,"n_rows":27,"n_cols":9,"rows_kept":27,"merged":[[0,3,0,8],[1,3,1,7],[3,1,3,3],[4,1,4,8],[5,0,5,2],[6,3,6,8],[9,0,9,8],[11,2,11,8],[12,0,12,8],[13,0,13,8],[14,0,14,8],[15,0,15,8],[16,0,16,8],[17,0,17,8],[25,0,25,8],[26,0,26,8]]}
[{"$nulls":3},"RECIBO DE CAJA"]
[{"$nulls":3},"Nº",{"$nulls":4},{"v":5,"d":"005"}]
[]
["FECHA:",{"$f":"NOW()","v":"2023-06-29T10:37:05.130"},{"$nulls":6},{"$f":"VLOOKUP(I2,CONSECUTIVO!$B$2:$H$200,3,FALSE)","v":{"v":8000000,"d":"$ 8,000,000"}}]
["RECIBIDO DE:",{"$f":"VLOOKUP(I2,CONSECUTIVO!$B$2:$H$200,2,FALSE)","v":"JOHN FERNEY GUTIERREZ LARA"}]
[{"$f":"\"DIRECCION:        \"&VLOOKUP(B5,DATOS!$B$2:$G$100,2,FALSE)","v":"DIRECCION:        CALLE 2 # 38B 43"},null,null,"C.C.",{"$f":"\"\"&VLOOKUP(B5,DATOS!$B$2:$F$100,4,FALSE)","v":"X"},"NIT.",{"$f":"\"\"&VLOOKUP(B5,DATOS!$B$2:$F$100,5,FALSE)","v":""},null,{"$f":"VLOOKUP(B5,DATOS!$B$2:$G$100,6,FALSE)","v":{"v":74184896,"d":"74,184,896"}}]
["FORMA DE PAGO:",null,{"$f":"\"\"&VLOOKUP(I2,CONSECUTIVO!$B$2:$H$200,4,FALSE)","v":"EFECTIVO"},{"$f":"\"TEL.  \"&VLOOKUP(B5,DATOS!$B$2:$G$100,3,FALSE)","v":"TEL.  3124482140"}]
[]
[]
[{"$f":"PesosCO(I4)","v":"LA SUMA DE:  OCHO MILLONES PESOS M/CTE."}]
[]
[]
[{"$f":"\"POR CONCEPTO DE:  \"&VLOOKUP(I2,CONSECUTIVO!$B$2:$H$200,5,FALSE)","v":"POR CONCEPTO DE:  "}]
[]
[{"$f":"\"\"&VLOOKUP(I2,CONSECUTIVO!$B$2:$H$200,6,FALSE)","v":"ABONO MOLDES MICHELIN"}]
[{"$f":"\"\"&VLOOKUP(I2,CONSECUTIVO!$B$2:$H$200,7,FALSE)","v":""}]
[{"$f":"\"\"&VLOOKUP(I2,CONSECUTIVO!$B$2:$I$200,8,FALSE)","v":""}]
[{"$f":"\"\"&VLOOKUP(I2,CONSECUTIVO!$B$2:$J$200,9,FALSE)","v":""}]
["DINERO ENTREGADO POR:",null,null,"      FIRMA Y SELLO DE RECIBIDO:"]
[]
[]
["  __________________",null,null,"       ______________________"]
["NIT. o  C.C."]
["      ",null,null,"                  "]
[]
["Calle 39 SUR Nº 31A-47  Barrio Ingles  Bogotá D.C. Colombia.  Tel: (601) 7004325"]
["pagina web:  metaltronicos.com          e-mail:  metaltronicos@metaltronicos.com"]

{"sheet":"ADJUNTO MILLER","index":4,"n_rows":28,"n_cols":5,"rows_kept":28,"merged":[[27,1,27,3]]}
[]
[]
[null,"ADJUNTO RECIBO DE CAJA Nº 066"]
[]
[null,"2014-03-22",448,"IVR",{"$f":"C5*90","v":{"v":40320,"d":"$ 40,320"}}]
[null,"2014-04-07",192,"IVR",{"v":17280,"d":"$ 17,280"}]
[null,"2014-06-09",177,"IVR",{"v":15930,"d":"$ 15,930"}]
[null,"2014-06-10",168,"IVR",{"v":15120,"d":"$ 15,120"}]
[null,"TOTAL IVR",{"$f":"SUM(C5:C8)","v":985},"IVR",{"$f":"SUM(E5:E8)","v":{"v":88650,"d":"$ 88,650"}}]
[]
[null,"2013-12-10",503,"SMS",{"$f":"C11*80","v":{"v":40240,"d":"$ 40,240"}}]
[null,"2013-12-11",82,"SMS",{"v":6560,"d":"$ 6,560"}]
[null,"2013-12-12",136,"SMS",{"v":10880,"d":"$ 10,880"}]
[null,"2013-12-13",92,"SMS",{"v":7360,"d":"$ 7,360"}]
[null,"2013-12-16",23,"SMS",{"v":1840,"d":"$ 1,840"}]
[null,"2014-02-07",177,"SMS",{"v":14160,"d":"$ 14,160"}]
[null,"2014-02-14",683,"SMS",{"v":54640,"d":"$ 54,640"}]
[null,"2014-03-10",599,"SMS",{"v":47920,"d":"$ 47,920"}]
[null,"2014-03-12",662,"SMS",{"v":52960,"d":"$ 52,960"}]
[null,"2014-03-15",324,"SMS",{"v":25920,"d":"$ 25,920"}]
[null,"2014-03-19",335,"SMS",{"v":26800,"d":"$ 26,800"}]
[null,"2014-03-20",648,"SMS",{"v":51840,"d":"$ 51,840"}]
[null,"2014-04-07",318,"SMS",{"v":25440,"d":"$ 25,440"}]
[null,"2014-05-06",281,"SMS",{"v":22480,"d":"$ 22,480"}]
[null,"2014-06-09",251,"SMS",{"v":20080,"d":"$ 20,080"}]
[null,"TOTAL SMS",{"$f":"SUM(C11:C25)","v":5114},"SMS",{"$f":"SUM(E11:E25)","v":{"v":409120,"d":"$ 409,120"}}]
[]
[null,"TOTAL",null,null,{"$f":"E26+E9","v":{"v":497770,"d":"$ 497,770"}}]