{"text_format":"3","workbook":"xlsx","n_sheets":16,"sheets":["CONSECUTIVO","DATOS","OTROS","TH FIBERGLASS","FSS INTER","DPI DIGITAL","DEKONSTRUCTODO","DEKONSTRUCTODO PRECIOS","AGAZO DESING","Bucaramanga 1","PRIMAX","PANATECH","ACUSTEC","MADELTEC","furgon","MACROLASER"],"not_rendered":{"images":2,"macros":1,"defined_names":14},"read":"whole","date_system":"1900"}

{"sheet":"CONSECUTIVO","index":0,"n_rows":201,"n_cols":18,"rows_kept":201}
[null,"Nº","RECIBIDO DE:","POR CONCEPTO DE: 1/5",null,null,"PAGADO"]
[null,1,"FSS INTER",{"v":1184500,"d":"$ 1,184,500"},"2024-01-26",null,"2024-01-26"]
[null,2,"TH FIBERGLASS",{"v":430589,"d":"$ 430,589"},"2024-01-31",null,"2023-02-01"]
[null,3,"DEKONSTRUCTODO",{"v":130000,"d":"$ 130,000"},"2024-02-01",null,"2024-02-26"]
[null,4,"MACROLASER",{"v":175000,"d":"$ 175,000"},"2024-02-02",null,"2024-02-07"]
[null,5,"FSS INTER",{"v":592250,"d":"$ 592,250"},"2024-02-06",null,"2024-02-16"]
[null,6,"DEKONSTRUCTODO",{"v":185000,"d":"$ 185,000"},"2024-02-07",null,"2024-02-26"]
[null,7,"FSS INTER",{"v":592250,"d":"$ 592,250"},"2024-02-27",null,"2024-02-29"]
[null,8,"DEKONSTRUCTODO",{"v":236757,"d":"$ 236,757"},"2024-03-01",null,"2024-03-27"]
[null,9,"DEKONSTRUCTODO",{"v":357767,"d":"$ 357,767"},"2024-03-06",null,"2024-03-27"]
[null,10,"MACROLASER",{"v":150000,"d":"$ 150,000"},"2024-04-03",null,"2024-04-05",null,"ABONO $1.800.000 25/07/2023 PENDIENTE $865.000 LIBRES, PAGO SALDO $865 28/09/2023"]
[null,11,"DEKONSTRUCTODO",{"v":80000,"d":"$ 80,000"},"2024-04-04",null,"2024-04-09"]
[null,12,"MACROLASER",{"v":100000,"d":"$ 100,000"},"2024-04-05",null,"2024-04-05"]
[null,13,"FSS INTER",{"v":430589,"d":"$ 430,589"},"2024-04-25",null,"2024-05-10"]
[null,14,"PANATECH",{"v":510000,"d":"$ 510,000"},"2024-04-26",null,"2024-05-02",null,"ACUSTEC",{"v":11824000,"d":"$ 11,824,000"}]
[null,15,"PANATECH",{"v":91000,"d":"$ 91,000"},"2024-05-03",{"$nulls":4},{"v":-2230000,"d":"($ 2,230,000)"}]
[null,16,"DEKONSTRUCTODO",{"v":135000,"d":"$ 135,000"},"2024-06-05",null,"2024-06-13",null,null,{"v":-2280000,"d":"($ 2,280,000)"}]
[null,17,"DEKONSTRUCTODO",{"v":160000,"d":"$ 160,000"},"2024-07-19",null,"2024-07-23",null,null,{"v":-2500000,"d":"($ 2,500,000)"}]
[null,18,"DEKONSTRUCTODO",{"v":347244,"d":"$ 347,244"},"2024-08-06",null,"2024-08-21",null,null,{"v":-2040000,"d":"($ 2,040,000)"}]
[null,19,"DEKONSTRUCTODO",{"v":150000,"d":"$ 150,000"},"2024-08-28",null,"2024-09-03",null,null,{"v":-2350000,"d":"($ 2,350,000)"}]
[null,20,"DEKONSTRUCTODO",{"v":95000,"d":"$ 95,000"},"2024-10-30",null,"2024-11-08",null,null,{"v":-424000,"d":"($ 424,000)"}]
[null,21,"DPI DIGITAL",{"v":430589,"d":"$ 430,589"},"2024-11-01",null,"2024-11-05"]
[null,22,"DEKONSTRUCTODO",{"v":126000,"d":"$ 126,000"},"2024-11-15",null,"2024-11-19",{"$nulls":8},60,100]
[null,23,{"$nulls":6},{"v":0.06,"d":"6%"},"RETEFUENTE",{"v":0.06,"d":"6%"},{"$nulls":4},54,{"$f":"(P24*Q23)/P23","v":90}]
[null,24,{"$nulls":6},"11,04 X 1.000","RETEICA",{"v":0.01104,"d":"1.104%"}]
[null,25,{"$nulls":8},{"$f":"K24+K25","v":{"v":0.07103999999999999,"d":"7.104%"}},"TOTAL RETENCIONES",null,null,"18:30:00",18.5]
[null,26,{"$nulls":8},{"$f":"100%-K26","v":{"v":0.92896,"d":"92.896%"}},"NETO RECIBIDO EN %",null,null,"20:54:00",20.9]
[null,27,{"$nulls":6},"VALOR NETO",{"v":400000,"d":"$ 400,000"},{"$f":"(J28*K26)/K27+J28","v":{"v":430589.04581467446,"d":"$ 430,589"}},"VALOR CUENTA DE COBRO",null,null,"18:41:00"]
[null,28,{"$nulls":13},{"$f":"SUM(P26:P28)","v":39.4},{"$f":"P29*4200","v":165480}]
[null,29,{"$nulls":7},"COMPROBACION",{"v":430589,"d":"$ 430,589"},"VALOR CUENTA DE COBRO"]
[null,30,{"$nulls":8},{"$f":"K30*6%","v":{"v":25835.34,"d":"$ 25,835"}},"RETEFUENTE",{"$nulls":4},{"$f":"P28+P27","v":20.9},{"$f":"Q31*4200","v":87780}]
[null,31,{"$nulls":8},{"$f":"(K30/1000)*11.04","v":{"v":4753.70256,"d":"$ 4,754"}},"RETEICA",{"$nulls":5},{"$f":"P26*4200","v":77700}]
[null,32,{"$nulls":8},{"$f":"K30-K31-K32","v":{"v":399999.95743999997,"d":"$ 400,000"}},"VALOR NETO"]
[null,33]
[null,34,{"$nulls":6},"DEKONSTRUCTODO"]
[null,35,{"$nulls":6},{"v":0.06,"d":"6%"},"RETEFUENTE",{"v":0.04,"d":"4%"}]
[null,36,{"$nulls":6},"9,66 X 1.000","RETEICA",{"v":0.00966,"d":"0.966%"}]
[null,37,{"$nulls":8},{"$f":"K36+K37","v":{"v":0.04966,"d":"4.966%"}},"TOTAL RETENCIONES"]
[null,38,{"$nulls":8},{"$f":"100%-K38","v":{"v":0.95034,"d":"95.034%"}},"NETO RECIBIDO EN %"]
[null,39,"DEKONSTRUCTODO",{"v":200000,"d":"$ 200,000"},"2022-12-16",{"$nulls":3},"VALOR NETO",{"v":400000,"d":"$ 400,000"},{"$f":"(J40*K38)/K39+J40","v":{"v":420901.9929709367,"d":"$ 420,902"}},"VALOR CUENTA DE COBRO"]
[null,40]
[null,41,{"$nulls":7},"COMPROBACION",{"v":347244,"d":"$ 347,244"},"VALOR CUENTA DE COBRO"]
[null,42,{"$nulls":8},{"$f":"K42*4%","v":{"v":13889.76,"d":"$ 13,890"}},"RETEFUENTE"]
[null,43,{"$nulls":8},{"$f":"(K42/1000)*9.66","v":{"v":3354.3770400000003,"d":"$ 3,354"}},"RETEICA"]
[null,44,{"$nulls":8},{"$f":"K42-K43-K44","v":{"v":329999.86296,"d":"$ 330,000"}},"VALOR NETO"]
[null,45]
[null,46]
[null,47]
[null,48]
[null,49]
[null,50]
[null,51]
[null,52]
[null,53]
[null,54]
[null,55]
[null,56]
[null,57]
[null,58]
[null,59]
[null,60]
[null,61]
[null,62]
[null,63]
[null,64]
[null,65]
[null,66]
[null,67]
[null,68]
[null,69]
[null,70]
[null,71]
[null,72]
[null,73]
[null,74]
[null,75]
[null,76]
[null,77]
[null,78]
[null,79]
[null,80]
[null,81]
[null,82]
[null,83]
[null,84]
[null,85]
[null,86]
[null,87]
[null,88]
[null,89]
[null,90]
[null,91]
[null,92]
[null,93]
[null,94]
[null,95]
[null,96]
[null,97]
[null,98]
[null,99]
[null,100]
[null,101]
[null,102]
[null,103]
[null,104]
[null,105]
[null,106]
[null,107]
[null,108]
[null,109]
[null,110]
[null,111]
[null,112]
[null,113]
[null,114]
[null,115]
[null,116]
[null,117]
[null,118]
[null,119]
[null,120]
[null,121]
[null,122]
[null,123]
[null,124]
[null,125]
[null,126]
[null,127]
[null,128]
[null,129]
[null,130]
[null,131]
[null,132]
[null,133]
[null,134]
[null,135]
[null,136]
[null,137]
[null,138]
[null,139]
[null,140]
[null,141]
[null,142]
[null,143]
[null,144]
[null,145]
[null,146]
[null,147]
[null,148]
[null,149]
[null,150]
[null,151]
[null,152]
[null,153]
[null,154]
[null,155]
[null,156]
[null,157]
[null,158]
[null,159]
[null,160]
[null,161]
[null,162]
[null,163]
[null,164]
[null,165]
[null,166]
[null,167]
[null,168]
[null,169]
[null,170]
[null,171]
[null,172]
[null,173]
[null,174]
[null,175]
[null,176]
[null,177]
[null,178]
[null,179]
[null,180]
[null,181]
[null,182]
[null,183]
[null,184]
[null,185]
[null,186]
[null,187]
[null,188]
[null,189]
[null,190]
[null,191]
[null,192]
[null,193]
[null,194]
[null,195]
[null,196]
[null,197]
[null,198]
[null,199]
[null,200]

{"sheet":"DATOS","index":1,"n_rows":7,"n_cols":7,"rows_kept":7}
[null,"NOMBRE","DIRECCION","TELEFONO","C.C.","NIT.","Nº C.C. ó NIT."]
[null,"INVERSIONES Y ASESORIAS ERPO & CIA S.C.S","CRA 8 Nº 15-73 OF. 802",4863737,null,null,"830.084.358-2"]
[null,"DEALERCOM LTDA.","CARRERA 16 Nº 61-23",3474237,null,"X","830.104.838-3"]
[null,"PUNTO SALITRE.","AV. ESPERANZA CON 68D",6006015]
[null,"AFA LTDA.","CALLE 19 Nº 5 -25 PISO 7",3365410,null,"X","860.401.653-0"]
[null,"COSINTE LTDA.","CRA 14 Nº 95-61",6103337,null,"X","830.019.581-2"]
[null,"DPI DIGITAL SAS","CRA 28A 72 23",null,null,"X",{"v":900568389,"d":"900,568,389"}]

{"sheet":"OTROS","index":2,"n_rows":25,"n_cols":16,"rows_kept":25,"merged":[[0,3,0,5],[1,3,1,4],[3,1,3,4],[4,1,4,4],[5,0,5,2],[5,3,5,5],[6,0,6,2],[6,3,6,5],[7,0,7,5],[8,0,8,5],[10,0,10,5],[11,0,11,5],[12,0,12,5],[14,2,14,3],[15,2,15,3],[23,0,23,5],[24,0,24,5]]}
[{"$nulls":3},"CUENTA DE COBRO"]
[{"$nulls":3},"Nº",null,{"v":17,"d":"017"}]
[]
["FECHA","CLIENTE",{"$nulls":3},"C.C. ó NIT."]
[{"$f":"NOW()","v":"2024-11-21T13:30:22.690"},{"$f":"VLOOKUP(F2,CONSECUTIVO!$B$2:$F$200,2,FALSE)","v":"DEKONSTRUCTODO"},{"$nulls":3},{"$f":"VLOOKUP(B5,DATOS!$B$2:$G$100,6,FALSE)","v":{"$error":"#N/A"}},null,null,"SELECCIONE EL TIPO",null,2,{"$nulls":4},"MI PLANILLA"]
["DIRECCION",null,null,"TELEFONO",{"$nulls":11},"VOUCHER"]
[{"$f":"VLOOKUP(B5,DATOS!$B$2:$G$100,2,FALSE)","v":{"$error":"#N/A"}},null,null,{"$f":"VLOOKUP(B5,DATOS!$B$2:$G$100,3,FALSE)","v":{"$error":"#N/A"}},{"$nulls":4},1,"MI PLANILLA"]
["DEBE A:",{"$nulls":7},2,"VOUCHER'S"]
["IPCOL NETWORKS",{"$nulls":7},3,"F S"]
[]
[{"$f":"PesosCO(F22)","v":"LA SUMA DE:  CIENTO CINCUENTA MIL PESOS M/CTE."}]
["POR CONCEPTO DE:"]
[{"$f":"\"\"&VLOOKUP(F2,CONSECUTIVO!$B$2:$F$200,3,FALSE)","v":"160000"}]
[{"$nulls":8},2,"FECHA","CANT.","VOUCHER","VALOR UNITARIO","VALOR TOTAL"]
[{"$f":"\"\"&VLOOKUP(K5,#REF!,2,FALSE)","v":{"$error":"#REF!"}},{"$f":"\"\"&VLOOKUP(K5,#REF!,3,FALSE)","v":{"$error":"#REF!"}},"DESCRIPCION",null,{"$f":"\"\"&VLOOKUP(K5,#REF!,5,FALSE)","v":{"$error":"#REF!"}},{"$f":"\"\"&VLOOKUP(K5,#REF!,6,FALSE)","v":{"$error":"#REF!"}}]
["FEBRERO 2014",null,"PRESTAMO HECHO POR EDUARDO GROSSO",null,{"v":150000,"d":"$ 150,000"},{"v":150000,"d":"$ 150,000"}]
[]
[]
[]
[]
[null,"ACEPTADA POR:",null,"       ______________________","                  "]
[null,null,"_______________________________",null,"TOTAL",{"$f":"SUM(F16:F20)","v":{"v":150000,"d":"$ 150,000"}}]
[null,null,"C.C."]
["IPCOL NETWORKS.  Carrera 16 Nº 61-23 Bogotá D.C. Colombia. Tel: 2112433"]
["pagina web:   ipcol.ath.cx                     e-mail:  ipcol.ath.cx@hotmail.com"]

{"sheet":"TH FIBERGLASS","index":3,"n_rows":45,"n_cols":7,"rows_kept":45,"merged":[[4,1,4,4],[10,0,10,6],[11,0,11,6],[15,0,15,6],[19,0,19,6],[20,0,20,6],[24,0,24,6],[25,0,25,6],[30,0,30,6],[31,0,31,6],[43,0,43,6],[44,0,44,6]]}
[]
[]
[]
[]
["Bogotá D.C.","Miercoles, 31 de enero de 2024."]
[]
[]
[{"$nulls":6},"CUENTA DE COBRO No. 002"]
[]
[]
["TH FIBERGLASS PARTS S.A.S."]
["NIT: 901.586.069-0"]
[]
[]
[]
["DEBE A:"]
[]
[]
[]
["WILMER VALERO"]
["C.C. No. 80.056.937"]
[]
[]
[]
[{"$f":"PesosCO(A26)","v":"LA SUMA DE:  CUATROCIENTOS TREINTA MIL QUINIENTOS OCHENTA Y NUEVE PESOS M/CTE."}]
[{"v":430589,"d":"$ 430,589"}]
[]
[]
["POR CONCEPTO DE:"]
[]
["Servicio de limpieza, lubricación y alineación de eje Z en router CNC."]
{"$rows_empty":8}
["WILMER VALERO."]
["C.C. No. 80.056.937"]
["Tel: 3105719964"]
[]
["Acorde al articulo 383 del ET, certifico bajo la gravedad de juramento que mis ingresos"]
["provienen de rentas laborales y no he subcontratado, para efectos de retencion en la fuente."]

{"sheet":"FSS INTER","index":4,"n_rows":45,"n_cols":7,"rows_kept":45,"merged":[[4,1,4,4],[10,0,10,6],[11,0,11,6],[15,0,15,6],[19,0,19,6],[20,0,20,6],[24,0,24,6],[25,0,25,6],[30,0,30,6],[31,0,31,6],[32,0,32,6],[43,0,43,6],[44,0,44,6]]}
[]
[]
[]
[]
["Bogotá D.C.","Jueves, 25 de abril de 2024."]
[]
[]
[{"$nulls":6},"CUENTA DE COBRO No. 013"]
[]
[]
["FSS INTER S.A.S."]
["NIT: 900.569.315-2"]
[]
[]
[]
["DEBE A:"]
[]
[]
[]
["WILMER VALERO"]
["C.C. No. 80.056.937"]
[]
[]
[]
[{"$f":"PesosCO(A26)","v":"LA SUMA DE:  CUATROCIENTOS TREINTA MIL QUINIENTOS OCHENTA Y NUEVE PESOS M/CTE."}]
[{"v":430589,"d":"$ 430,589"}]
[]
[]
["POR CONCEPTO DE:"]
[]
["Mantenimiento de router CNC."]
{"$rows_empty":8}
["WILMER VALERO."]
["C.C. No. 80.056.937"]
["Tel: 3105719964"]
[]
["Acorde al articulo 383 del ET, certifico bajo la gravedad de juramento que mis ingresos"]
["provienen de rentas laborales y no he subcontratado, para efectos de retencion en la fuente."]

{"sheet":"DPI DIGITAL","index":5,"n_rows":45,"n_cols":7,"rows_kept":45,"merged":[[4,1,4,4],[10,0,10,6],[11,0,11,6],[15,0,15,6],[19,0,19,6],[20,0,20,6],[24,0,24,6],[25,0,25,6],[30,0,30,6],[31,0,31,6],[33,0,33,6],[34,0,34,6],[43,0,43,6],[44,0,44,6],[54,0,54,6],[55,0,55,6]]}
[]
[]
[]
[]
["Bogotá D.C.","Viernes, 1 de noviembre de 2024."]
[]
[]
[{"$nulls":6},"CUENTA DE COBRO No. 021"]
[]
[]
["DPI DIGITAL SAS."]
["NIT: 900.568.389"]
[]
[]
[]
["DEBE A:"]
[]
[]
[]
["WILMER VALERO"]
["C.C. No. 80.056.937"]
[]
[]
[]
[{"$f":"PesosCO(A26)","v":"LA SUMA DE:  CUATROCIENTOS TREINTA MIL QUINIENTOS OCHENTA Y NUEVE PESOS M/CTE."}]
[{"v":430589,"d":"$ 430,589"}]
[]
[]
["POR CONCEPTO DE:"]
[]
["Programacion inversor de voltaje, marca FULING, ref. BD612."]
[]
[]
["ORDEN DE GIRO: "]
["NEQUI 318 2853603 (Eduardo Grosso)"]
[]
[]
[]
[]
["WILMER VALERO."]
["C.C. No. 80.056.937"]
["Tel: 3105719964"]
[]
["Acorde al articulo 383 del ET, certifico bajo la gravedad de juramento que mis ingresos"]
["provienen de rentas laborales y no he subcontratado, para efectos de retencion en la fuente."]

{"sheet":"DEKONSTRUCTODO","index":6,"n_rows":45,"n_cols":7,"rows_kept":45,"merged":[[4,1,4,4],[10,0,10,6],[11,0,11,6],[15,0,15,6],[19,0,19,6],[20,0,20,6],[24,0,24,6],[25,0,25,6],[30,0,30,6],[31,0,31,6],[43,0,43,6],[44,0,44,6],[54,0,54,6],[55,0,55,6]]}
[]
[]
[]
[]
["Bogotá D.C.","Viernes, 15 de noviembre de 2024."]
[]
[]
[{"$nulls":6},"CUENTA DE COBRO No. 022"]
[]
[]
["DEKONSTRUCTODO S.A.S."]
["NIT: 901.067.886-5"]
[]
[]
[]
["DEBE A:"]
[]
[]
[]
["WILMER VALERO"]
["C.C. No. 80.056.937"]
[]
[]
[]
[{"$f":"PesosCO(A26)","v":"LA SUMA DE:  CIENTO VEINTISEIS MIL PESOS M/CTE."}]
[{"v":126000,"d":"$ 126,000"}]
[]
[]
["POR CONCEPTO DE:"]
[]
["Corte lamina de alucobond, según Orden de Trabajo No 01-2411141"]
{"$rows_empty":8}
["WILMER VALERO."]
["C.C. No. 80.056.937"]
["Tel: 3105719964"]
[]
["Acorde al articulo 383 del ET, certifico bajo la gravedad de juramento que mis ingresos"]
["provienen de rentas laborales y no he subcontratado, para efectos de retencion en la fuente."]

{"sheet":"DEKONSTRUCTODO PRECIOS","index":7,"n_rows":37,"n_cols":9,"rows_kept":37,"merged":[[2,3,2,4]]}
[]
[]
[null,"FECHA","VALOR","AREA",null,"AREA TOTAL"]
[null,"2022-01-13",{"v":60000,"d":"$ 60,000"},2.4,0.5,{"$f":"D4*E4","v":1.2}]
[null,"2022-02-14",{"v":90000,"d":"$ 90,000"},3.5,0.85,{"$f":"D5*E5","v":2.975}]
[null,"2022-02-22",{"v":100000,"d":"$ 100,000"},4.2,1.05,4.41]
[null,"2022-02-24",{"v":90000,"d":"$ 90,000"},3.4,0.85,2.8899999999999997,null,"area","precio"]
[null,"2022-02-25",{"v":60000,"d":"$ 60,000"},2.1,0.65,1.3650000000000002,null,{"v":1.5,"d":"1.50"},{"v":60000,"d":"$ 60,000"}]
[null,"2022-03-24",{"v":70000,"d":"$ 70,000"},2.5,0.65,1.625,null,{"v":1.9,"d":"1.90"},{"v":70000,"d":"$ 70,000"}]
[null,"2022-03-29",{"v":100000,"d":"$ 100,000"},3.5,0.95,3.3249999999999997,null,{"v":2.3,"d":"2.30"},{"v":80000,"d":"$ 80,000"}]
[null,"2022-03-30",{"v":100000,"d":"$ 100,000"},3.5,0.95,3.3249999999999997,null,{"v":2.7,"d":"2.70"},{"v":90000,"d":"$ 90,000"}]
[null,"2022-04-06",{"v":100000,"d":"$ 100,000"},4,1.05,4.2,null,{"v":3.1,"d":"3.10"},{"v":100000,"d":"$ 100,000"}]
[null,"2022-04-07",{"v":60000,"d":"$ 60,000"},2,0.65,1.3]
[null,"2022-04-28",{"v":60000,"d":"$ 60,000"},2.1,0.55,1.1550000000000002]
[null,"2022-06-06",{"v":60000,"d":"$ 60,000"},2.3,0.65,1.4949999999999999]
[null,"2022-06-06",{"v":60000,"d":"$ 60,000"},2.3,0.85,1.9549999999999998]
[null,"2022-06-16",{"v":60000,"d":"$ 60,000"},2.5,0.75,1.875]
[null,"2022-06-21",{"v":65000,"d":"$ 65,000"},3,0.8,2.4000000000000004]
[null,"2022-06-21",{"v":65000,"d":"$ 65,000"},3,0.8,{"$f":"D19*E19","v":2.4000000000000004}]
[null,"2022-07-26",{"v":90000,"d":"$ 90,000"},3.4,0.95,3.23]
[null,"2022-07-26",{"v":60000,"d":"$ 60,000"},2.7,0.95,2.565]
[null,"2022-08-17",{"v":60000,"d":"$ 60,000"},2.5,0.65,1.625]
[null,"2022-09-28",{"v":100000,"d":"$ 100,000"},3.6,0.85,3.06]
[null,"2022-09-28",{"v":70000,"d":"$ 70,000"},2.6,0.85,2.21]
[null,"2022-09-29",{"v":100000,"d":"$ 100,000"},3.6,0.85,3.06]
[null,"2022-09-29",{"v":70000,"d":"$ 70,000"},2.6,0.85,2.21]
[null,"2022-10-10",{"v":60000,"d":"$ 60,000"},2.5,0.65,{"$f":"D27*E27","v":1.625}]
[null,"2022-10-25",null,2.5,0.55,1.375]
[{"$nulls":3},5.3,1.3,6.89]
[null,"2023-02-01",null,3.6,0.95,3.42,"CON TAPAS",{"v":140000,"d":"$ 140,000"}]
[{"$nulls":3},4.05,0.9,3.645]
[{"$nulls":3},3.5,0.75,2.625]
[{"$nulls":3},4.5,1.05,{"$f":"D33*E33","v":4.7250000000000005},"CON TAPAS",{"v":170000,"d":"$ 170,000"}]
[]
[]
[]
[{"$nulls":6},{"v":4200,"d":"$ 4,200"},"min que marque router"]

{"sheet":"AGAZO DESING","index":8,"n_rows":45,"n_cols":7,"rows_kept":45,"merged":[[4,1,4,4],[10,0,10,6],[11,0,11,6],[15,0,15,6],[19,0,19,6],[20,0,20,6],[24,0,24,6],[25,0,25,6],[30,0,30,6],[31,0,31,6],[43,0,43,6],[44,0,44,6]]}
[]
[]
[]
[]
["Bogotá D.C.","Viernes, 17 de junio de 2022."]
[]
[]
[{"$nulls":6},"CUENTA DE COBRO No. 018"]
[]
[]
["AGAZO DESING S.A.S."]
["NIT: 900.177.361-9"]
[]
[]
[]
["DEBE A:"]
[]
[]
[]
["WILMER VALERO"]
["C.C. No. 80.056.937"]
[]
[]
[]
[{"$f":"PesosCO(A26)","v":"LA SUMA DE:  CIENTO CINCUENTA MIL PESOS M/CTE."}]
[{"v":150000,"d":"$ 150,000"}]
[]
[]
["POR CONCEPTO DE:"]
[]
["Corte de 3 laminas de MDF, según diseño."]
{"$rows_empty":8}
["WILMER VALERO."]
["C.C. No. 80.056.937"]
["Tel: 3105719964"]
[]
["Acorde al articulo 383 del ET, certifico bajo la gravedad de juramento que mis ingresos"]
["provienen de rentas laborales y no he subcontratado, para efectos de retencion en la fuente."]

{"sheet":"Bucaramanga 1","index":9,"n_rows":45,"n_cols":7,"rows_kept":45,"merged":[[4,1,4,3],[10,0,10,6],[11,0,11,6],[15,0,15,6],[19,0,19,6],[20,0,20,6],[24,0,24,6],[25,0,25,6],[30,0,30,6],[31,0,31,6],[43,0,43,6],[44,0,44,6]]}
[]
[]
[]
[]
["Bucaramanga, ","Miercoles, 14 de agosto de 2019."]
[]
[]
[{"$nulls":6},"CUENTA DE COBRO No. 001"]
[]
[]
["LA BODEGA ELECTRICA S.A.S."]
["NIT: 804.014.181-2"]
[]
[]
[]
["DEBE A:"]
[]
[]
[]
["WILMER VALERO"]
["C.C. No. 80.056.937"]
[]
[]
[]
[{"$f":"PesosCO(A26)","v":"LA SUMA DE:  TRESCIENTOS MIL PESOS M/CTE."}]
[{"v":300000,"d":"$ 300,000"}]
[]
[]
["POR CONCEPTO DE:"]
[]
["Induccion de manejo, y puesta en marcha de Router CNC 60x90,"]
["con sotfware NC-Studio"]
{"$rows_empty":7}
["WILMER VALERO."]
["C.C. No. 80.056.937"]
["Tel: 3105719964"]
[]
["Acorde al articulo 383 del ET, certifico bajo la gravedad de juramento que mis ingresos"]
["provienen de rentas laborales y no he subcontratado, para efectos de retencion en la fuente."]

{"sheet":"PRIMAX","index":10,"n_rows":45,"n_cols":7,"rows_kept":45,"merged":[[4,1,4,3],[10,0,10,6],[11,0,11,6],[15,0,15,6],[19,0,19,6],[20,0,20,6],[24,0,24,6],[25,0,25,6],[30,0,30,6],[31,0,31,6],[43,0,43,6],[44,0,44,6]]}
[]
[]
[]
[]
["Bogotá D.C., ","Viernes, 13 de marzo de 2020."]
[]
[]
[{"$nulls":6},"CUENTA DE COBRO No. 002"]
[]
[]
["PRIMAX COLOMBIA S.A."]
["NIT: 860,002,554-8"]
[]
[]
[]
["DEBE A:"]
[]
[]
[]
["WILMER VALERO"]
["C.C. No. 80.056.937"]
[]
[]
[]
[{"$f":"PesosCO(A26)","v":"LA SUMA DE:  DOSCIENTOS DIECINUEVE MIL SEISCIENTOS NOVENTA Y OCHO PESOS M/CTE."}]
[{"v":219698,"d":"$ 219,698"}]
[]
[]
["POR CONCEPTO DE:"]
[]
["Verificación, y puesta en marcha de Router CNC 60x90,"]
["con sotfware NC-Studio"]
{"$rows_empty":7}
["WILMER VALERO."]
["C.C. No. 80.056.937"]
["Tel: 3105719964"]
[]
["Acorde al articulo 383 del ET, certifico bajo la gravedad de juramento que mis ingresos"]
["provienen de rentas laborales y no he subcontratado, para efectos de retencion en la fuente."]

{"sheet":"PANATECH","index":11,"n_rows":47,"n_cols":7,"rows_kept":47,"merged":[[4,1,4,4],[13,0,13,6],[14,0,14,6],[18,0,18,6],[22,0,22,6],[23,0,23,6],[27,0,27,6],[28,0,28,6],[35,0,35,6],[36,0,36,6]]}
[]
[]
[]
[]
["Bogotá D.C.","Viernes, 3 de mayo de 2024."]
[]
[]
[]
[{"$nulls":6},"CUENTA DE COBRO No. 015"]
[]
[]
[]
[]
["PANATECH INGENIERIA DISEÑO Y TECNOLOGIA S.A.S"]
["NIT: 901.155.925-1"]
[]
[]
[]
["DEBE A:"]
[]
[]
[]
["WILMER VALERO"]
["C.C. No. 80.056.937"]
[]
[]
[]
[{"$f":"PesosCO(A29)","v":"LA SUMA DE:  NOVENTA Y UN MIL PESOS M/CTE."}]
[{"v":91000,"d":"$ 91,000"}]
[]
[]
[]
["POR CONCEPTO DE:"]
[]
[]
["Corte de lamina melamina, según planos."]
{"$rows_empty":8}
["WILMER VALERO."]
["C.C. No. 80.056.937"]
["Tel: 3105719964"]

{"sheet":"ACUSTEC","index":12,"n_rows":45,"n_cols":7,"rows_kept":45,"merged":[[4,1,4,4],[10,0,10,6],[11,0,11,6],[15,0,15,6],[19,0,19,6],[20,0,20,6],[24,0,24,6],[25,0,25,6],[30,0,30,6],[31,0,31,6],[43,0,43,6],[44,0,44,6],[54,0,54,6],[55,0,55,6]]}
[]
[]
[]
[]
["Bogotá D.C.","Viernes, 16 de junio de 2023."]
[]
[]
[{"$nulls":6},"CUENTA DE COBRO No. 014"]
[]
[]
["ACUSTICA TECNICA ACUSTEC DE COLOMBIA S.A.S"]
["NIT: 830.068.504-4"]
[]
[]
[]
["DEBE A:"]
[]
[]
[]
["WILMER VALERO"]
["C.C. No. 80.056.937"]
[]
[]
[]
[{"$f":"PesosCO(A26)","v":"LA SUMA DE:  CUATROCIENTOS TREINTA MIL QUINIENTOS OCHENTA Y NUEVE PESOS M/CTE."}]
[{"v":430589,"d":"$ 430,589"}]
[]
[]
["POR CONCEPTO DE:"]
[]
["Servico de alineacion a escuadra y paralelismo de Router CNC."]
{"$rows_empty":8}
["WILMER VALERO."]
["C.C. No. 80.056.937"]
["Tel: 3105719964"]
[]
["Acorde al articulo 383 del ET, certifico bajo la gravedad de juramento que mis ingresos"]
["provienen de rentas laborales y no he subcontratado, para efectos de retencion en la fuente."]

{"sheet":"MADELTEC","index":13,"n_rows":48,"n_cols":7,"rows_kept":48,"merged":[[4,1,4,4],[13,0,13,6],[14,0,14,6],[18,0,18,6],[22,0,22,6],[23,0,23,6],[27,0,27,6],[28,0,28,6],[35,0,35,6],[36,0,36,6],[38,0,38,6],[39,0,39,6]]}
[]
[]
[]
[]
["Bogotá D.C.","Miercoles, 15 de marzo de 2023."]
[]
[]
[]
[{"$nulls":6},"CUENTA DE COBRO No. 004"]
[]
[]
[]
[]
["MADELTEC S.A.S"]
["NIT: 900.759.865-7"]
[]
[]
[]
["DEBE A:"]
[]
[]
[]
["WILMER VALERO"]
["C.C. No. 80.056.937"]
[]
[]
[]
[{"$f":"PesosCO(A29)","v":"LA SUMA DE:  TRESCIENTOS VEINTIDOS MIL CUATROCIENTOS SESENTA Y TRES PESOS M/CTE."}]
[{"v":322463,"d":"$ 322,463"}]
[]
[]
[]
["POR CONCEPTO DE:"]
[]
[]
["Servicios de mantenimiento de 2 Router CNC."]
[]
[]
["ORDEN DE GIRO: "]
["Bancolombia      Cuenta de Ahorros      200 758 044 57      Eduardo Grosso C.C. 79.463.699"]
[]
[]
[]
[]
["WILMER VALERO."]
["C.C. No. 80.056.937"]
["Tel: 3105719964  Dir: Calle 39 sur # 31A - 47"]
["wival@hotmail.com"]

{"sheet":"furgon","index":14,"n_rows":45,"n_cols":7,"rows_kept":45,"merged":[[4,1,4,4],[10,0,10,6],[11,0,11,6],[15,0,15,6],[19,0,19,6],[20,0,20,6],[24,0,24,6],[25,0,25,6],[30,0,30,6],[31,0,31,6],[43,0,43,6],[44,0,44,6]]}
[]
[]
[]
[]
["Bogotá D.C.","Lunes, 5 de septiembre de 2022."]
[]
[]
[{"$nulls":6},"CUENTA DE COBRO No. 026"]
[]
[]
["REDES Y OBRAS CIVILES ROCS S.A.S."]
["NIT: 901.545.617"]
[]
[]
[]
["DEBE A:"]
[]
[]
[]
["WILMER VALERO"]
["C.C. No. 80.056.937"]
[]
[]
[]
[{"$f":"PesosCO(A26)","v":"LA SUMA DE:  CUATROCIENTOS MIL PESOS M/CTE."}]
[{"v":400000,"d":"$ 400,000"}]
[]
[]
["POR CONCEPTO DE:"]
[]
["PUERTAS PARA FURGON USADAS."]
{"$rows_empty":8}
["WILMER VALERO."]
["C.C. No. 80.056.937"]
["Tel: 3105719964"]
[]
["Acorde al articulo 383 del ET, certifico bajo la gravedad de juramento que mis ingresos"]
["provienen de rentas laborales y no he subcontratado, para efectos de retencion en la fuente."]

{"sheet":"MACROLASER","index":15,"n_rows":45,"n_cols":7,"rows_kept":45,"merged":[[4,1,4,4],[10,0,10,6],[11,0,11,6],[15,0,15,6],[19,0,19,6],[20,0,20,6],[24,0,24,6],[25,0,25,6],[30,0,30,6],[31,0,31,6],[43,0,43,6],[44,0,44,6]]}
[]
[]
[]
[]
["Bogotá D.C.","Viernes, 5 de abril de 2024."]
[]
[]
[{"$nulls":6},"CUENTA DE COBRO No. 012"]
[]
[]
["IMPORTADORA MACROLASER HR S.A.S"]
["NIT: 900.630.491-0"]
[]
[]
[]
["DEBE A:"]
[]
[]
[]
["WILMER VALERO"]
["C.C. No. 80.056.937"]
[]
[]
[]
[{"$f":"PesosCO(A26)","v":"LA SUMA DE:  CIEN MIL PESOS M/CTE."}]
[{"v":100000,"d":"$ 100,000"}]
[]
[]
["POR CONCEPTO DE:"]
[]
["Servicio de verificacion de parametros en Router CNC."]
{"$rows_empty":8}
["WILMER VALERO."]
["C.C. No. 80.056.937"]
["Tel: 3105719964"]
[]
["Acorde al articulo 383 del ET, certifico bajo la gravedad de juramento que mis ingresos"]
["provienen de rentas laborales y no he subcontratado, para efectos de retencion en la fuente."]