{"text_format":"3","workbook":"xlsx","n_sheets":6,"sheets":["CONSECUTIVO","DATOS","ORDEN DE SERVICIO (2)","REMISION $","REMISION","PRECIOS"],"not_rendered":{"images":3,"macros":1,"defined_names":3},"read":"whole","date_system":"1900"}

{"sheet":"CONSECUTIVO","index":0,"n_rows":202,"n_cols":10,"rows_kept":202}
[null,"Nº","RECIBIDO DE:","VALOR","FORMA DE PAGO","POR CONCEPTO DE: 1/5","POR CONCEPTO DE: 2/5","POR CONCEPTO DE: 3/5","POR CONCEPTO DE: 4/5","POR CONCEPTO DE: 5/5"]
[null,1,"GEODESICOS COLOMBIA S.A.S.",{"$nulls":3},"CORTES EN POLICARBONATO DE 4mm, SEGÚN PLANOS. 12 CONJUNTOS DE 18 PIEZAS CADA UNO.","TOTAL 216 PIEZAS.  ","SE ENTREGA RETAL SOBRANTE."]
[null,2,"LIBARDO DIAZ",{"v":20000,"d":"$ 20,000"},"EFECTIVO","SERVICIO PLANTA GSM PLUS.","S/N: 0650381: CAMBIO RJ11 PWR"]
[null,3,"LINDA YASMIN ALDANA",{"v":40000,"d":"$ 40,000"},"EFECTIVO","SERVICIO PLANTA GSM TARIFADORA REF. GSM-6000T.","S/N: 0610163. CAMBIO MICRO $40, PROG. PLANTA (CEL DIRECTO $100, NAL DIRECTO $100)."]
[null,4,"LINDA YASMIN ALDANA",{"v":35000,"d":"$ 35,000"},"EFECTIVO","SERVICIO PLANTA GSM TARIFADORA REF. GSM-6000T.","S/N: 0610151. CAMBIO RJ PWR $20, PROG. PLANTA (CEL DIRECTO $100, NAL DIRECTO $100) $15."]
[null,5,"ADOLFO TORRES",{"v":60000,"d":"$ 60,000"},"EFECTIVO","SERVICIO IPCOL TARIFICADOR SIN S/N. INTEGRADO RUIDO $35","VISOR IPCOL TARIFICADOR S/N 07300055. CAMBIO RJ11 $20, HERRAJES $5"]
[null,6,"CLAUDIA GUERRERO",{"v":25000,"d":"$ 25,000"},"EFECTIVO","SERVICIO VISOR DISOL ","SIN S/N: CAMBIO RJ11, HERRAJE DISIPADOR."]
[null,7,"JAVIANO QUIROGA",{"v":30000,"d":"$ 30,000"},"EFECTIVO","PROGRAMACION 5 MICROCONTROLADORES PARA EASYGATE"]
[null,8,"PHONET",{"v":30000,"d":"$ 30,000"},"EFECTIVO","SERVICIO PLANTA TMC-5000 S/N 0600029","FLASH MODEM"]
[null,9,"JAVIANO QUIROGA",{"v":24000,"d":"$ 24,000"},"EFECTIVO","PROGRAMACION 4 MICROCONTROLADORES PARA EASYGATE"]
[null,10,"BORIS CADRAZCO",{"v":10000,"d":"$ 10,000"},"EFECTIVO","REVISION 4 PLANTAS GSM PLUS, NO SE ENCONTRO DAÑO"]
[null,11,"CARLOS RIGUEROS",{"v":60000,"d":"$ 60,000"},"CRUCE - COMISION","SERVICIO SUPER ROUTER DEALERCALL","S/N: 0630306 CAMBIO MT $30","S/N: 0630324 CAMBIO MT $30"]
[null,12,"ALBA AZUCENA GALLO",{"v":60000,"d":"$ 60,000"},"EFECTIVO","1 ADAPTADOR DE VOLTAJE PARA PLANTA GSM ($60)"]
[null,13,"ALFONSO MILLAN",{"v":10000,"d":"$ 10,000"},"EFECTIVO",null,"2 PONCHADAS ADAPTADOR DE VOLTAJE GSM ($10)"]
[null,14,"CARLOS RIGUEROS",{"v":20000,"d":"$ 20,000"},"EFECTIVO","SERVICIO IPCOL TARIFICADOR SIN S/N. PULSADOR (15), DESBLOQUEO Y HERRAJES."]
[null,15,"JORGE HERNANDEZ",{"v":45000,"d":"$ 45,000"},"EFECTIVO","SERVICIO SUPERROUTER DEALERCALL S/N: 0630002, CAMBIO RJ y LED ($25)","ARREGLO CONTROLADORA ROUTER DEALERCALL ($20)"]
[null,16,"VICTOR PHONET",{"v":15000,"d":"$ 15,000"},"EFECTIVO","PROGRAMACION MICROCONTROLADOR PLANTA GSM 7000 PLUS S/N: 0650347"]
[null,17,"JOSE GIOVANNY GARZON",{"v":20000,"d":"$ 20,000"},"EFECTIVO","ARREGLO CONTROLADORA DE VISORES DEALERCALL S/N: 0770040"]
[null,18,"MARILUZ TORRES",{"v":40000,"d":"$ 40,000"},"EFECTIVO","SERVICIO PLANTA GSM TARIFADORA REF. GSM-6000T.","S/N: 0610153. FLASH MODEM $30. PROG. PLANTA $10."]
[null,19,"JAVIANO QUIROGA",{"v":60000,"d":"$ 60,000"},"EFECTIVO","PROGRAMACION 10 MICROCONTROLADOR PARA EASYGATE"]
[null,20,"ALBA AZUCENA GALLO",{"v":60000,"d":"$ 60,000"},"EFECTIVO","1 ADAPTADOR DE VOLTAJE PARA PLANTA GSM ($60)"]
[null,21]
[null,22]
[null,23]
[null,24]
[null,25,"JOSE GIOVANNY GARZON",{"v":20000,"d":"$ 20,000"},"EFECTIVO","ARREGLO CONTROLADORA DE VISORES DEALERCALL S/N: 0770040"]
[null,26,"VICTOR PHONET",{"v":15000,"d":"$ 15,000"},"EFECTIVO","PROGRAMACION MICROCONTROLADOR PLANTA GSM 7000 PLUS S/N: 0650347"]
[null,27]
[null,28,{"$nulls":3},"SERVICIO PLANTA GSM TARIFADORA REF. GSM-6000T.","S/N: 06100085. ACEPTOR $20, PULSADOR $15."]
[null,29]
[null,30]
[null,31]
[null,32]
[null,33]
[null,34]
[null,35]
[null,36]
[null,37]
[null,38]
[null,39]
[null,40]
[null,41]
[null,42]
[null,43]
[null,44]
[null,45]
[null,46]
[null,47]
[null,48]
[null,49]
[null,50]
[null,51]
[null,52,"JAVIANO QUIROGA",{"v":24000,"d":"$ 24,000"},"EFECTIVO","PROGRAMACION 4 MICROCONTROLADORES PARA EASYGATE"]
[null,53,"JOSE GIOVANNY GARZON",{"v":50000,"d":"$ 50,000"},"EFECTIVO","REVISION SUPER ROUTER DEALERCALL","0630321, 0630322, 0630200, 0630317, 0630315, 0630318, 0630320."]
[null,54,"EDNA HERNANDEZ",{"v":30000,"d":"$ 30,000"},"EFECTIVO","SERVICIO PLANTA GSM TARIFADORA REF. GSM-6000T.","S/N: 0610164. FLASH MODEM"]
[null,55,"JAVIANO QUIROGA",{"v":12000,"d":"$ 12,000"},"EFECTIVO","PROGRAMACION 2 MICROCONTROLADORES PARA EASYGATE"]
[null,56,"LEIVER PEREA",{"v":120000,"d":"$ 120,000"},"EFECTIVO","SERVICIO PLANTA GSM TARIFADORA REF. GSM-6000T.","S/N: 06100085. ACEPTOR $20, PULSADOR $15.","S/N: 06100135. ACEPTOR $20, FLASH MODEM $30.","S/N: 06100142. ACEPTOR $20, PULSADOR $15."]
[null,57,"LEIVER PEREA",{"v":60000,"d":"$ 60,000"},"EFECTIVO","SERVICIO PLANTA GSM TARIFADORA REF. GSM-6000T.","S/N: 06100186. ACEPTOR $20.","S/N: 06100187. ACEPTOR $20.","S/N: 06100188. ACEPTOR $20."]
[null,58,"PHONET",{"v":30000,"d":"$ 30,000"},"EFECTIVO","SERVICIO PLANTA TMC-5000 S/N 0600029","FLASH MODEM"]
[null,59,"JAVIANO QUIROGA",{"v":60000,"d":"$ 60,000"},"EFECTIVO","PROGRAMACION 10 MICROCONTROLADORES PARA EASYGATE",null,"SE ENTREGAN LAS SIM's: 9340, 0244, 9328, 4515 DE ELADIO ROJAS."]
[null,60,"LEIVER PEREA",{"v":45000,"d":"$ 45,000"},"EFECTIVO","SERVICIO PLANTA GSM TARIFADORA REF. GSM-6000T.","S/N: 06100142. PROGRAMACION PLANTA $15: COMCEL Y FIJOS $100, OTROS OPERADORES $200.","S/N: 06100187. PROGRAMACION PLANTA $15: COMCEL Y FIJOS $100, OTROS OPERADORES $200.","S/N: 06100188. PROGRAMACION PLANTA $15: COMCEL Y FIJOS $100, OTROS OPERADORES $200."]
[null,61,"EVARISTO ROMERO",{"v":15000,"d":"$ 15,000"},"EFECTIVO","REVISION.","CONCENTRADOR DE LINEAS SISTEMA DEALERCALL. SOLDADURAS $10.","VISOR SISTEMA DEALERCALL S/N 0620231. PROGRAMACION CABINA Nº 4 A Nº 8. $5."]
[null,62,"PHONET",{"v":60000,"d":"$ 60,000"},"EFECTIVO","SERVICIO PLANTA GSM PLUS.","S/N: 0650292. RESOLDAR ACEPTOR $10.","S/N: 0650338. ACEPTOR $20, RELEVO $30."]
[null,63,"JAVIANO QUIROGA",{"v":30000,"d":"$ 30,000"},"EFECTIVO","SERVICIO PLANTA TMC-5000 ","S/N 0600240: DETECCION CORTO SOLDADURAS $15, PROGRAMACION PLANTA $15"]
[null,64,"EDNA HERNANDEZ",{"v":40000,"d":"$ 40,000"},"EFECTIVO","SERVICIO PLANTA GSM TARIFADORA REF. GSM-6000T. S/N 0610022","CAMBIO MICROCONTROLADOR, PROGRAMACION INCLUIDA (CEL NAL $150, FIJO $100)."]
[null,65,"ALFONSO MILLAN",{"v":30000,"d":"$ 30,000"},"EFECTIVO","SERVICIO CONTROLADORA SERIAL ROUTER DEALERCALL S/N 0780002","CAMBIO INTEGRADO."]
[null,66,"PHONET",{"v":45000,"d":"$ 45,000"},"EFECTIVO","SERVICIO PLANTA GSM PLUS.","S/N 0650259. FLASH $30, SOLDADURAS ACEPTOR $10, HERRAJES BOARD $5."]
[null,67,"BORIS CADRAZCO",{"v":15000,"d":"$ 15,000"},"EFECTIVO","SERVICIO PLANTA GSM.","S/N 0600128. CAMBIO ACEPTOR $15"]
[null,68,"PHONET",{"v":90000,"d":"$ 90,000"},"EFECTIVO","SERVICIO PLANTA GSM PLUS.","S/N 0650314. FLASH $30.","S/N 0650392. FLASH $30.","S/N 0650470. CAMBIO RELEVO $30."]
[null,69,"EDNA HERNANDEZ",{"v":75000,"d":"$ 75,000"},"EFECTIVO","SERVICIO PLANTA GSM TARIFADORA REF. GSM-6000T.","S/N: 0610022. PROG PLANTA $15 (SIN LINEA, CEL 3, NAL 03, TODO $100)","S/N: 0610164. PROG PLANTA $15 (SIN LINEA, CEL 3, NAL 03, TODO $100)","S/N: 0610015. ACEPTOR $15, PROG MICRO $15, ","                          PROG PLANTA $15 (CON LINEA, CEL 03, NAL 07, FIJO DIRECTO, TODO $100)"]
[null,70,"LUZ DARY CAMACHO",{"v":15000,"d":"$ 15,000"},"EFECTIVO","SERVICIO PLANTA GSM PLUS.","S/N 0650128. TAPA ACEPTOR."]
[null,71,"ANA MARIA OVALLE",{"v":65000,"d":"$ 65,000"},"EFECTIVO","SERVICIO PLANTAS TMC-5000.","S/N 0600112, CAMBIO PIN ACEPTOR MODEM $15, ","S/N 0600121, CAMBIO RJ11 DOBLE $20, ","ADAPTADOR Nº 007, CAMBIO C RUIDO $20, PONCHADO $5","ADAPTADOR Nº 008, PONCHADO $5"]
[null,72,"PHONET",{"v":70000,"d":"$ 70,000"},"EFECTIVO","SERVICIO PLANTA GSM PLUS.","S/N: 0650314. RELEVO $30.","S/N: 0650338. PROG PLANTA $15.","S/N: 0650392. RESOLDAR ACEPTOR $10. PROG PLANTA $15."]
[null,73,"PHONET",{"v":30000,"d":"$ 30,000"},"EFECTIVO","SERVICIO PLANTA GSM PLUS.","S/N: 0650470. FLASH $30."]
[null,74,"DEALERCOM LTDA.",{"v":24000,"d":"$ 24,000"},"CRUCE DE CUENTAS","MICROCONTROLADOR PIC16F628 PROGRAMADO GSM 7002","ENTREGADO 05/05/2014"]
[null,75,"ALBA AZUCENA GALLO",{"v":45000,"d":"$ 45,000"},"EFECTIVO","SERVICIO PLANTAS.","TMC-5000 S/N: 0600133, FLASH MODEM $30","GSM PLUS S/N: 0650364, PROG. PLANTA (CEL 3XX, NAL 03X, TODO X SIM) $15"]
[null,76,"EVARISTO ROMERO",{"v":50000,"d":"$ 50,000"},"EFECTIVO","REPARACION 1 SUPERROUTER, 2 CONTROLADORAS SUPERROUTER","1 CONCENTRADOR DE LINEAS"]
[null,77,"ANA LUCIA CUBILLOS",{"v":85000,"d":"$ 85,000"},"EFECTIVO","SERVICIO PLANTA GSM PLUS.","S/N: 0650197. ACEPTOR $20.","S/N: 0650200. ACEPTOR $20, FLASH $30.","ADAPTADOR Nº 009, PONCHADO $5, ADAPTADOR Nº 010, PONCHADO $5","ADAPTADOR Nº 011, PONCHADO $5"]
[null,78,"DEALERCOM LTDA.",{"v":15000,"d":"$ 15,000"},"CRUCE DE CUENTAS","ARREGLO CONTROLADORA SUPERROUTER SALITRE","ENTREGADO 10/07/2014"]
[null,79,"PHONET",{"v":30000,"d":"$ 30,000"},"EFECTIVO","SERVICIO PLANTA GSM PLUS.","S/N: 0650362. FLASH $30."]
[null,80,"GUILLERMO PINILLOS",{"v":20000,"d":"$ 20,000"},"EFECTIVO","SERVICIO PLANTA GSM PLUS.","S/N: 0650128. CAMBIO ACEPTOR Y SOLDADURA SIM."]
[null,81,"PHONET",{"v":60000,"d":"$ 60,000"},"EFECTIVO","SERVICIO PLANTA GSM PLUS.","S/N: 0650314. FLASH $30.","S/N: 0650390. FLASH $30."]
[null,82,"LEIVER PEREA",{"v":100000,"d":"$ 100,000"},"EFECTIVO","SERVICIO PLANTA GSM TARIFADORA REF. GSM-6000T.","S/N: 0610043. PULSADOR $15, HERRAJES $5.","S/N: 0610064. ACEPTOR $20.","S/N: 0610080. ACEPTOR $20, CAMBIO MICROCONTROLADOR Y PROG $40 (TODO DESTINO $100)"]
[null,83,"LEIVER PEREA",{"v":130000,"d":"$ 130,000"},"EFECTIVO","SERVICIO PLANTA GSM TARIFADORA REF. GSM-6000T.","S/N: 0610136. ACEPTOR $20, PULSADOR $15, FLASH $30, ANTENA $5, PROG $15 (TODO DESTINO $100)","S/N: 0610186. FLASH $30, PROG $15 (TODO DESTINO $100)"]
[null,84,"ALBA AZUCENA GALLO",{"v":60000,"d":"$ 60,000"},"EFECTIVO","SERVICIO PLANTAS.","GSM PLUS S/N: 0650333, FLASH MODEM $30","GSM PLUS S/N: 0650364, FLASH MODEM $30"]
[null,85,"ALFONSO MILLAN",{"v":40000,"d":"$ 40,000"},"EFECTIVO","SERVICIO SUPER ROUTER DEALERCALL","S/N 0630298: CAMBIO MICROCONTROLADOR."]
[null,86,"ALFONSO MILLAN",{"v":10000,"d":"$ 10,000"},"EFECTIVO","SERVICIO CONTROLADORA SUPER ROUTER DEALERCALL","S/N 0780002: REVISION Y SOLDADURAS."]
[null,87,"PHONET",{"v":5000,"d":"$ 5,000"},"EFECTIVO","SERVICIO PLANTA TMC 5000.","S/N: 0600181. HERRAJES Y AISLANTE $5."]
[null,88,"MARILUZ TORRES",{"v":140000,"d":"$ 140,000"},"EFECTIVO","SERVICIO PLANTA GSM TARIFADORA REF. GSM-6000T.","S/N: 0610151. ACEPTOR $20, PULSADOR $15, PROG. PLANTA $15 (CEL DIRECTO $150, NAL DIRECTO $200).","S/N: 0610163. ACEPTOR $20, PULSADOR $15, PROG. PLANTA $15 (CEL DIRECTO $150, NAL DIRECTO $200).","                            CAMBIO TAPA+LCD $40."]
[null,89,"LIBARDO DIAZ",{"v":15000,"d":"$ 15,000"},"EFECTIVO","REVISION PLANTA GSM PLUS.","S/N: 0650381: CORTO, NO ENCENDIA MODEM."]
[null,90,"PHONET",{"v":90000,"d":"$ 90,000"},"EFECTIVO","SERVICIO PLANTA GSM PLUS.","S/N: 0650258. RELEVO $30.","S/N: 0650421. FLASH $30.","S/N: 0650471. FLASH $30."]
[null,91]
[null,92]
[null,93,"CESAR MORENO",{"v":90000,"d":"$ 90,000"},"EFECTIVO","SERVICIO PLANTA GSM TARIFADORA REF. GSM-6000T. S/N 0610125","ACEPTOR $20, HERRAJES MODEM $10, RJ 11 DOBLE $20","CAMBIO MICRO (INCLUYE PROG. PLANTA) $40"]
[null,94,"EDNA HERNANDEZ",{"v":50000,"d":"$ 50,000"},"EFECTIVO","SERVICIO PLANTA GSM TARIFADORA REF. GSM-6000T.","S/N: 0610162. CAMBIO RJ11 SENCILLO $20, PROGRAMACION MICROCONTORLADOR $15 ","PROG PLANTA $15 (SIN LINEA, CEL 3, NAL 03, TODO $100)"]
[null,95,"DIEGO RODRIGUEZ",{"v":50000,"d":"$ 50,000"},"EFECTIVO","ARREGLO CONTROLADORA SUPERROUTER DEALERCALL","CAMBIO ADAPTADOR DE VOLTAJE SUPERROUTER DEALERCALL","ARREGLOS HECHOS EL DIA 26/05/2014."]
[null,96]
[null,97]
[null,98]
[null,99]
[null,100]
[null,101]
[null,102]
[null,103]
[null,104]
[null,105]
[null,106]
[null,107]
[null,108]
[null,109]
[null,110]
[null,111]
[null,112]
[null,113]
[null,114]
[null,115]
[null,116]
[null,117]
[null,118]
[null,119]
[null,120]
[null,121]
[null,122]
[null,123]
[null,124]
[null,125]
[null,126]
[null,127]
[null,128]
[null,129]
[null,130]
[null,131]
[null,132]
[null,133]
[null,134]
[null,135]
[null,136]
[null,137]
[null,138]
[null,139]
[null,140]
[null,141]
[null,142]
[null,143]
[null,144]
[null,145]
[null,146]
[null,147]
[null,148]
[null,149]
[null,150]
[null,151]
[null,152]
[null,153]
[null,154]
[null,155]
[null,156]
[null,157]
[null,158]
[null,159]
[null,160]
[null,161]
[null,162]
[null,163]
[null,164]
[null,165]
[null,166]
[null,167]
[null,168]
[null,169]
[null,170]
[null,171]
[null,172]
[null,173]
[null,174]
[null,175]
[null,176]
[null,177]
[null,178]
[null,179]
[null,180]
[null,181]
[null,182]
[null,183]
[null,184]
[null,185]
[null,186]
[null,187]
[null,188]
[null,189]
[null,190]
[null,191]
[null,192]
[null,193]
[null,194]
[null,195]
[null,196]
[null,197]
[null,198]
[null,199]
[null,200]
[null,null,"VALIDACION DE DATOS"]

{"sheet":"DATOS","index":1,"n_rows":41,"n_cols":7,"rows_kept":41}
[null,"NOMBRE","DIRECCION","TELEFONO","C.C.","NIT.","Nº C.C. ó NIT."]
[null,"ADOLFO TORRES","CRA 71C Nº 5B-18","5636564 - 3112667121","X",null,{"v":17175977,"d":"17,175,977"}]
[null,"ALBA AZUCENA GALLO","CRA 81 Nº 46-08 BRITALIA",3123746595,"X",null,{"v":37942994,"d":"37,942,994"}]
[null,"ALBERTO MURCIA","CLL 159 B N 8- f 20",6706648,"x",null,{"v":19242167,"d":"19,242,167"}]
[null,"ALFONSO MILLAN","AV 19 Nº 136-38","2585424 - 3108527290",null,"X","860.527.241-1"]
[null,"ALIRIO RODRIGUEZ","CLL 167 N 65-23 CALIMA NORTE",3203434295,"X",null,{"v":17129050,"d":"17,129,050"}]
[null,"ANA LUCIA CUBILLOS","CALLE 68 Nº 74A-63","2767608 - 3115817750",null,"X",{"v":51708345,"d":"51,708,345"}]
[null,"ANA MARIA OVALLE","CRA 1G ESTE Nº 76B-27 SUR",7646250,"X",null,{"v":52524644,"d":"52,524,644"}]
[null,"ANGEL VALOYES M","CR 105 N  16 H- 12",3115940931]
[null,"BORIS CADRAZCO","CLL 86 N 69H-35 CATALUÑA","3114571794-7503482","X",null,{"v":79938372,"d":"79,938,372"}]
[null,"CARLOS RIGUEROS",null,3106803329,"X",null,{"v":79556310,"d":"79,556,310"}]
[null,"CARMEN CECILIA DAZA RODRIGUEZ","CENTRO COMERCIAL  TUNAL","7146201-3132351798","X",null,{"v":51631074,"d":"51,631,074"}]
[null,"CESAR MORENO"]
[null,"CLAUDIA GUERRERO","CRA 64B Nº 55A-47 SUR VILLA DEL RIO",3125822873,"X",null,{"v":51854507,"d":"51,854,507"}]
[null,"DEALERCOM LTDA.","CARRERA 16 Nº 61-23",3474237,null,"X","830.104.838-3"]
[null,"DIEGO RODRIGUEZ","CALLE 57 Nº 13-74",8050400,"X",null,{"v":79380941,"d":"79,380,941"}]
[null,"EDISON NIÑO",null,3124509657]
[null,"EDNA HERNANDEZ","CALLE 57 Nº 23-50",3208608313,"X",null,{"v":65746344,"d":"65,746,344"}]
[null,"EFREN ARAGON",null,3003001082,"X",null,{"v":80235717,"d":"80,235,717"}]
[null,"EVARISTO ROMERO","AV. CALLE 13 Nº 90-89",2678757]
[null,"GEODESICOS COLOMBIA S.A.S.",null,3204614982,null,"X","901.365.768-2"]
[null,"GONZALO PRIETO","CLLE 38 Nº 35-12 SUR",3112515178,"X",null,{"v":19263926,"d":"19,263,926"}]
[null,"GUILLERMO PINILLOS","CRA 17 Nº 2-14 SUR SOACHA",3133187130,"X",null,{"v":79970076,"d":"79,970,076"}]
[null,"HAROLD CAVIEDES"]
[null,"JAVIANO QUIROGA",null,3006531046]
[null,"JORGE HERNANDEZ","CRA 13 Nº 13-47",3002152421,"X",null,{"v":80005350,"d":"80,005,350"}]
[null,"JOSE GIOVANNY GARZON","CARRERA 28 N 10 -86 LOCAL 103","2012274-3208071521","X",null,{"v":79974171,"d":"79,974,171"}]
[null,"JUAN MANUEL CARANZA","CR 80 68 B 04",3012650019,"X",null,{"v":79107296,"d":"79,107,296"}]
[null,"JULIAN ESCARPETA","CR 50 N 1 - 54  CIUDAD MONTES",3134241205,"X",null,{"v":80139866,"d":"80,139,866"}]
[null,"LEIVER PEREA","CALLE 127B BIS Nº 53-28","3125212075 - 3013392142","X",null,{"v":79631945,"d":"79,631,945"}]
[null,"LIBARDO DIAZ","CALLE 26 SUR Nº 73B-35","3208516031 - 3114553261","X",null,{"v":80356113,"d":"80,356,113"}]
[null,"LINDA YASMIN ALDANA","CRA 87 Nº 51B-74 SUR","7833252 - 3118234115","X",null,{"v":52298703,"d":"52,298,703"}]
[null,"LUZ DARY CAMACHO","CR 17 A N 12 - 25  SOACHA","9017665 - 3143226443","X",null,{"v":39544811,"d":"39,544,811"}]
[null,"LUZ MARY ZAMBRANO","CALLE 162 N 7G-55 Lc. 2 SAN CRISTOBAL","5266416 - 3163598865","X",null,{"v":39687770,"d":"39,687,770"}]
[null,"MARCELA DIAZ","ZIPAQUIRA"]
[null,"MARILUZ TORRES","CRA 87 Nº 51B-74 SUR","7833252 - 3115543491","X",null,{"v":52173075,"d":"52,173,075"}]
[null,"OSCAR MARMOLEJO",null,3105849118,null,null,{"v":79153777,"d":"79,153,777"}]
[null,"PHONET","TRANSVERSAL 24 Nº 61B-16",2178535]
[null,"SANDRA QUINTERO","CLL 76 N 20 B 81",3175832502,"X",null,{"v":52282963,"d":"52,282,963"}]
[null,"VICTOR GAVIRIA",null,3118903865,"X",null,{"v":4404395,"d":"4,404,395"}]
[null,"YESID PEREA","QUIBDO CHOCO",3216456494,"X",null,{"v":11799581,"d":"11,799,581"}]

{"sheet":"ORDEN DE SERVICIO (2)","index":2,"n_rows":29,"n_cols":9,"rows_kept":29,"merged":[[0,3,0,8],[1,3,1,7],[3,1,3,3],[4,1,4,8],[5,0,5,2],[6,3,6,8],[9,0,9,8],[11,2,11,8],[12,0,12,8],[13,0,13,8],[14,0,14,8],[15,0,15,8],[16,0,16,8],[17,0,17,8],[18,0,18,8],[19,0,19,8],[27,0,27,8],[28,0,28,8]]}
[{"$nulls":3},"ORDEN DE SERVICIO"]
[{"$nulls":3},"Nº",{"$nulls":4},{"v":1,"d":"001"}]
[]
["FECHA:",{"$f":"NOW()","v":"2024-02-09T15:10:10.400"},{"$nulls":6},{"$f":"VLOOKUP(I2,CONSECUTIVO!$B$2:$H$100,3,FALSE)","v":{"v":0,"d":"$ 0"}}]
["RECIBIDO DE:",{"$f":"VLOOKUP(I2,CONSECUTIVO!$B$2:$H$200,2,FALSE)","v":"GEODESICOS COLOMBIA S.A.S."}]
[{"$f":"\"DIRECCION:        \"&VLOOKUP(B5,DATOS!$B$2:$G$100,2,FALSE)","v":"DIRECCION:        "},null,null,"C.C.",{"$f":"\"\"&VLOOKUP(B5,DATOS!$B$2:$F$100,4,FALSE)","v":""},"NIT.",{"$f":"\"\"&VLOOKUP(B5,DATOS!$B$2:$F$100,5,FALSE)","v":"X"},null,{"$f":"VLOOKUP(B5,DATOS!$B$2:$G$100,6,FALSE)","v":"901.365.768-2"}]
["FORMA DE PAGO:",null,{"$f":"\"\"&VLOOKUP(I2,CONSECUTIVO!$B$2:$H$200,4,FALSE)","v":""},{"$f":"\"TEL.  \"&VLOOKUP(B5,DATOS!$B$2:$G$100,3,FALSE)","v":"TEL.  3204614982"}]
[]
[]
[{"$f":"PesosCO(I4)","v":"LA SUMA DE:  PESO M/CTE."}]
[]
[]
[{"$f":"\"POR CONCEPTO DE:   \"&VLOOKUP(I2,CONSECUTIVO!$B$2:$J$200,5,FALSE)","v":"POR CONCEPTO DE:   "}]
[]
[{"$f":"\"\"&VLOOKUP(I2,CONSECUTIVO!$B$2:$J$200,6,FALSE)","v":"CORTES EN POLICARBONATO DE 4mm, SEGÚN PLANOS. 12 CONJUNTOS DE 18 PIEZAS CADA UNO."}]
[{"$f":"\"\"&VLOOKUP(I2,CONSECUTIVO!$B$2:$J$200,7,FALSE)","v":"TOTAL 216 PIEZAS.  "}]
[{"$f":"\"\"&VLOOKUP(I2,CONSECUTIVO!$B$2:$J$200,8,FALSE)","v":"SE ENTREGA RETAL SOBRANTE."}]
[{"$f":"\"\"&VLOOKUP(I2,CONSECUTIVO!$B$2:$J$200,9,FALSE)","v":""}]
["El cliente admite con su firma haber recibido de forma satisfactoria los elementos relacionados en esta orden de servicio."]
["Garantia de 2 (dos) meses a partir de la fecha de entrega, y cubre el servicio relacionado. ES INDISPENSABLE PRESENTAR ESTE DOCUMENTO."]
["             ELABORADO:",null,null," FIRMA Y SELLO PRODUCTO RECIBIDO:"]
[]
[]
["  __________________",null,null,"       ______________________"]
[{"$nulls":3},"NIT. o  C.C."]
["      ",null,null,"                  "]
[]
["Calle 39 SUR Nº 31A-47  Barrio Ingles  Bogotá D.C. Colombia.  Tel: 7004325"]
["metaltronicos.com"]

{"sheet":"REMISION $","index":3,"n_rows":29,"n_cols":9,"rows_kept":29,"merged":[[0,3,0,8],[1,3,1,7],[3,1,3,3],[4,1,4,8],[5,0,5,2],[6,3,6,8],[9,0,9,8],[11,2,11,8],[12,0,12,8],[13,0,13,8],[14,0,14,8],[15,0,15,8],[16,0,16,8],[17,0,17,8],[18,0,18,8],[19,0,19,8],[27,0,27,8],[28,0,28,8]]}
[{"$nulls":3},"REMISION"]
[{"$nulls":3},"Nº",{"$nulls":4},{"v":1,"d":"001"}]
[]
["FECHA:",{"$f":"NOW()","v":"2024-02-09T15:10:10.400"},{"$nulls":6},{"$f":"VLOOKUP(I2,CONSECUTIVO!$B$2:$H$100,3,FALSE)","v":{"v":0,"d":"$ 0"}}]
["RECIBIDO DE:",{"$f":"VLOOKUP(I2,CONSECUTIVO!$B$2:$H$200,2,FALSE)","v":"GEODESICOS COLOMBIA S.A.S."}]
[{"$f":"\"DIRECCION:        \"&VLOOKUP(B5,DATOS!$B$2:$G$100,2,FALSE)","v":"DIRECCION:        "},null,null,"C.C.",{"$f":"\"\"&VLOOKUP(B5,DATOS!$B$2:$F$100,4,FALSE)","v":""},"NIT.",{"$f":"\"\"&VLOOKUP(B5,DATOS!$B$2:$F$100,5,FALSE)","v":"X"},null,{"$f":"VLOOKUP(B5,DATOS!$B$2:$G$100,6,FALSE)","v":"901.365.768-2"}]
["FORMA DE PAGO:",null,{"$f":"\"\"&VLOOKUP(I2,CONSECUTIVO!$B$2:$H$200,4,FALSE)","v":""},{"$f":"\"TEL.  \"&VLOOKUP(B5,DATOS!$B$2:$G$100,3,FALSE)","v":"TEL.  3204614982"}]
[]
[]
[{"$f":"PesosCO(I4)","v":"LA SUMA DE:  PESO M/CTE."}]
[]
[]
[{"$f":"\"POR CONCEPTO DE:   \"&VLOOKUP(I2,CONSECUTIVO!$B$2:$J$200,5,FALSE)","v":"POR CONCEPTO DE:   "}]
[]
[{"$f":"\"\"&VLOOKUP(I2,CONSECUTIVO!$B$2:$J$200,6,FALSE)","v":"CORTES EN POLICARBONATO DE 4mm, SEGÚN PLANOS. 12 CONJUNTOS DE 18 PIEZAS CADA UNO."}]
[{"$f":"\"\"&VLOOKUP(I2,CONSECUTIVO!$B$2:$J$200,7,FALSE)","v":"TOTAL 216 PIEZAS.  "}]
[{"$f":"\"\"&VLOOKUP(I2,CONSECUTIVO!$B$2:$J$200,8,FALSE)","v":"SE ENTREGA RETAL SOBRANTE."}]
[{"$f":"\"\"&VLOOKUP(I2,CONSECUTIVO!$B$2:$J$200,9,FALSE)","v":""}]
[]
[]
["             ELABORADO:",null,null," FIRMA Y SELLO PRODUCTO RECIBIDO:"]
[]
[]
["  __________________",null,null,"       ______________________"]
[{"$nulls":3},"NIT. o  C.C."]
["      ",null,null,"                  "]
[]
["Calle 39 SUR Nº 31A-47  Barrio Ingles  Bogotá D.C. Colombia.  Tel: 7004325"]
["pagina web:  metaltronicos.com          e-mail:  metaltronicos@metaltronicos.com"]

{"sheet":"REMISION","index":4,"n_rows":29,"n_cols":9,"rows_kept":29,"merged":[[0,3,0,8],[1,3,1,7],[3,1,3,3],[4,1,4,8],[5,0,5,2],[6,3,6,8],[9,0,9,8],[11,2,11,8],[12,0,12,8],[13,0,13,8],[14,0,14,8],[15,0,15,8],[16,0,16,8],[17,0,17,8],[18,0,18,8],[19,0,19,8],[27,0,27,8],[28,0,28,8]]}
[{"$nulls":3},"REMISION"]
[{"$nulls":3},"Nº",{"$nulls":4},{"v":1,"d":"001"}]
[]
["FECHA:",{"$f":"NOW()","v":"2024-02-09T15:10:10.400"}]
["ENTREGADO A:",{"$f":"VLOOKUP(I2,CONSECUTIVO!$B$2:$H$200,2,FALSE)","v":"GEODESICOS COLOMBIA S.A.S."}]
[{"$f":"\"DIRECCION:        \"&VLOOKUP(B5,DATOS!$B$2:$G$100,2,FALSE)","v":"DIRECCION:        "},null,null,"C.C.",{"$f":"\"\"&VLOOKUP(B5,DATOS!$B$2:$F$100,4,FALSE)","v":""},"NIT.",{"$f":"\"\"&VLOOKUP(B5,DATOS!$B$2:$F$100,5,FALSE)","v":"X"},null,{"$f":"VLOOKUP(B5,DATOS!$B$2:$G$100,6,FALSE)","v":"901.365.768-2"}]
[null,null,{"$f":"\"\"&VLOOKUP(I2,CONSECUTIVO!$B$2:$H$200,4,FALSE)","v":""},{"$f":"\"TEL.  \"&VLOOKUP(B5,DATOS!$B$2:$G$100,3,FALSE)","v":"TEL.  3204614982"}]
[]
[]
[]
[]
[]
[{"$f":"\"ENTREGA DE:   \"&VLOOKUP(I2,CONSECUTIVO!$B$2:$J$200,5,FALSE)","v":"ENTREGA DE:   "}]
[]
[{"$f":"\"\"&VLOOKUP(I2,CONSECUTIVO!$B$2:$J$200,6,FALSE)","v":"CORTES EN POLICARBONATO DE 4mm, SEGÚN PLANOS. 12 CONJUNTOS DE 18 PIEZAS CADA UNO."}]
[{"$f":"\"\"&VLOOKUP(I2,CONSECUTIVO!$B$2:$J$200,7,FALSE)","v":"TOTAL 216 PIEZAS.  "}]
[{"$f":"\"\"&VLOOKUP(I2,CONSECUTIVO!$B$2:$J$200,8,FALSE)","v":"SE ENTREGA RETAL SOBRANTE."}]
[{"$f":"\"\"&VLOOKUP(I2,CONSECUTIVO!$B$2:$J$200,9,FALSE)","v":""}]
[]
[]
["             ENTREGADO POR:",null,null," FIRMA Y SELLO PRODUCTO RECIBIDO:"]
[]
[]
["  __________________",null,null,"       ______________________"]
[{"$nulls":3},"NIT. o  C.C."]
["      ",null,null,"                  "]
[]
["Calle 39 SUR Nº 31A-47  Barrio Ingles  Bogotá D.C. Colombia.  Tel: 7004325"]
["pagina web:  metaltronicos.com          e-mail:  metaltronicos@metaltronicos.com"]

{"sheet":"PRECIOS","index":5,"n_rows":26,"n_cols":4,"rows_kept":26}
[]
[{"$nulls":3},"CON DTO 20% DEALERCOM"]
[null,"CAMBIO MODEM",{"v":75000,"d":"$ 75,000"},{"$f":"C3*0.8","v":{"v":60000,"d":"$ 60,000"}}]
[null,"FLASH MODEM",{"v":30000,"d":"$ 30,000"},{"$f":"C4*0.8","v":{"v":24000,"d":"$ 24,000"}}]
[null,"ACEPTOR",{"v":20000,"d":"$ 20,000"},{"v":16000,"d":"$ 16,000"}]
[null,"CAMBIO ACEPTOR",{"v":20000,"d":"$ 20,000"},{"v":16000,"d":"$ 16,000"}]
[null,"PROGRAMACION MICROCONTROLADOR",{"v":15000,"d":"$ 15,000"},{"v":12000,"d":"$ 12,000"}]
[null,"PROGRAMACION PLANTA",{"v":15000,"d":"$ 15,000"},{"v":12000,"d":"$ 12,000"}]
[null,"CONECTOR RJ11 HEMBRA",{"v":20000,"d":"$ 20,000"},{"v":16000,"d":"$ 16,000"}]
[null,"ACTUALIZACION VOLUMEN",{"v":20000,"d":"$ 20,000"},{"v":16000,"d":"$ 16,000"}]
[null,"RUIDO - RECONEXION DE ANTENA",{"v":20000,"d":"$ 20,000"},{"v":16000,"d":"$ 16,000"}]
[null,"REVISION",{"v":15000,"d":"$ 15,000"},{"v":12000,"d":"$ 12,000"}]
[null,"CAMBIO MICRO PIC16F628A",{"v":30000,"d":"$ 30,000"},{"v":24000,"d":"$ 24,000"}]
[null,"CAMBIO MICRO PIC16F876A",{"v":40000,"d":"$ 40,000"},{"v":32000,"d":"$ 32,000"}]
[null,"CAMBIO MICRO PIC 16F877A",{"v":40000,"d":"$ 40,000"},{"v":32000,"d":"$ 32,000"}]
[null,"ADAPTADOR NUEVO",{"v":60000,"d":"$ 60,000"},{"v":48000,"d":"$ 48,000"}]
[null,"CAMBIO TRANSFORMADOR",{"v":30000,"d":"$ 30,000"},{"v":24000,"d":"$ 24,000"}]
[null,"MANTENIMIENTO CTO. ELECTRONICO ADAPTADOR",{"v":20000,"d":"$ 20,000"},{"v":16000,"d":"$ 16,000"}]
[null,"PONCHADA RJ11 ",{"v":5000,"d":"$ 5,000"},{"v":4000,"d":"$ 4,000"}]
[null,"DAÑO 1 INTEGRADO SIN MICRO",{"v":30000,"d":"$ 30,000"},{"v":24000,"d":"$ 24,000"}]
[null,"DAÑO VARIOS INTEGRADOS SIN MICRO",{"v":40000,"d":"$ 40,000"},{"v":32000,"d":"$ 32,000"}]
[null,"DISPLAY",{"v":30000,"d":"$ 30,000"},{"v":24000,"d":"$ 24,000"}]
[null,"ANTENA NUEVA",{"v":25000,"d":"$ 25,000"},{"v":20000,"d":"$ 20,000"}]
[null,"PROGRAMACION MICRO EASYGATE JAVIANO",{"v":6000,"d":"$ 6,000"},4800]
[null,"PULSADOR",{"v":15000,"d":"$ 15,000"},12000]
[null,"RELEVO",{"v":30000,"d":"$ 30,000"},24000]